{"text_format":"1","workbook":"xlsx","n_sheets":8,"sheets":["Orçamento","Resumo ","Somatório","Cronog_120_Dias","Composição BDI","Relatório CENTRAL","Parc Maior Relev","Composições"],"not_rendered":{"charts":0,"images":6,"macros":1,"external_links":1,"defined_names":151,"comments":1,"pivot_tables":0},"unopened":[],"bounds":{"document_bytes":16777216,"sheet_cells":100000,"rows_first":2000,"rows_last":500,"rows_between":2000,"halvings":0,"cell_chars":16384,"cell_head_chars":4096},"cells_cut":0,"cells_raw":0,"read":"whole","date_system":"1900"}

{"sheet":"Orçamento","index":0,"n_rows":1004,"n_cols":24,"rows_kept":1004,"cut":false,"hidden":false,"merged":[[984,15,984,17],[984,18,984,20],[984,21,984,22],[940,16,940,22],[996,18,996,20],[996,21,996,22],[991,15,991,17],[991,18,991,20],[991,21,991,22],[992,15,992,17],[992,18,992,20],[992,21,992,22],[993,15,993,17],[993,18,993,20],[993,21,993,22],[985,18,985,20],[985,21,985,22],[986,15,986,17],[986,18,986,20],[986,21,986,22],[987,15,987,17],[987,18,987,20],[987,21,987,22],[982,15,982,17],[982,18,982,20],[982,21,982,22],[983,15,983,17],[972,14,972,17],[979,15,979,17],[945,15,945,17],[1000,18,1000,20],[1000,21,1000,22],[988,15,988,17],[988,18,988,20],[988,21,988,22],[989,15,989,17],[989,18,989,20],[989,21,989,22],[990,15,990,17],[990,18,990,20],[990,21,990,22],[994,15,994,17],[994,18,994,20],[994,21,994,22],[995,15,995,17],[995,18,995,20],[995,21,995,22],[996,15,996,17],[985,15,985,17],[983,18,983,20],[983,21,983,22],[1003,18,1003,20],[1003,21,1003,22],[1000,14,1000,17],[997,15,997,17],[997,18,997,20],[997,21,997,22],[998,15,998,17],[998,18,998,20],[998,21,998,22],[999,15,999,17],[999,18,999,20],[999,21,999,22],[1002,18,1002,20],[1002,21,1002,22],[1001,18,1001,20],[1001,21,1001,22],[978,14,978,23],[979,18,979,20],[979,21,979,22],[980,15,980,17],[980,18,980,20],[980,21,980,22],[981,15,981,17],[981,18,981,20],[981,21,981,22],[936,16,936,22],[937,16,937,22],[938,16,938,22],[3,21,3,22],[2,21,2,22],[5,21,5,22],[10,14,10,23],[13,14,13,23],[6,21,6,22],[2,14,2,20],[3,14,3,20],[5,18,5,20],[6,18,6,20],[6,14,6,17],[5,14,5,17],[12,21,12,22],[12,18,12,20],[8,18,8,20],[8,21,8,22],[9,19,9,20],[958,15,958,17],[959,15,959,17],[960,15,960,17],[961,15,961,17],[962,15,962,17],[963,15,963,17],[964,15,964,17],[965,15,965,17],[966,15,966,17],[946,15,946,17],[947,15,947,17],[948,15,948,17],[949,15,949,17],[950,15,950,17],[951,15,951,17],[952,15,952,17],[953,15,953,17],[954,15,954,17],[967,15,967,17],[968,15,968,17],[969,15,969,17],[970,15,970,17],[971,15,971,17],[944,14,944,23],[933,20,933,21],[932,20,932,21],[928,17,933,17],[928,20,928,21],[945,18,945,20],[945,21,945,22],[946,18,946,20],[946,21,946,22],[934,20,934,21],[954,18,954,20],[954,21,954,22],[955,18,955,20],[955,21,955,22],[956,18,956,20],[956,21,956,22],[957,18,957,20],[957,21,957,22],[969,18,969,20],[972,21,972,22],[969,21,969,22],[970,18,970,20],[970,21,970,22],[971,18,971,20],[971,21,971,22],[961,18,961,20],[961,21,961,22],[968,18,968,20],[968,21,968,22],[963,21,963,22],[964,18,964,20],[964,21,964,22],[966,18,966,20],[962,18,962,20],[962,21,962,22],[963,18,963,20],[973,21,973,22],[960,18,960,20],[960,21,960,22],[953,18,953,20],[953,21,953,22],[975,18,975,20],[975,21,975,22],[929,20,929,21],[951,18,951,20],[951,21,951,22],[952,18,952,20],[952,21,952,22],[950,18,950,20],[950,21,950,22],[959,18,959,20],[930,20,930,21],[941,18,941,22],[947,18,947,20],[947,21,947,22],[948,18,948,20],[948,21,948,22],[949,18,949,20],[949,21,949,22],[972,18,972,20],[939,16,939,22],[974,18,974,20],[974,21,974,22],[0,14,0,22],[8,14,8,16],[9,14,9,16],[11,14,11,16],[12,14,12,16],[14,14,14,22],[1,14,1,22],[4,14,4,22],[7,14,7,22],[958,18,958,20],[958,21,958,22],[966,21,966,22],[955,15,955,17],[956,15,956,17],[957,15,957,17],[959,21,959,22],[967,18,967,20],[967,21,967,22],[965,18,965,20],[965,21,965,22],[973,18,973,20]]}
[]
[]
[null,null,null,null,null,null,null,null,null,null,null,null,null,null,"UNIDADE ESCOLAR",null,null,null,null,null,null,"CÓDIGO INEP"]
[null,null,null,null,null,null,null,null,null,null,null,null,null,null,"CENTRO DE ENSINO EM PERÍODO INTEGRAL SYLVIO DE MELLO",null,null,null,null,null,null,52069206]
[]
["Nmax",null,null,null,null,null,null,null,null,null,null,null,null,null,"OBRA",null,null,null,"DATA",null,null,"CIDADE"]
[{"$f":"MAX($C$18:$C$928)","v":4},null,null,null,null,null,null,null,null,null,null,null,null,null,"REFORMA",null,null,null,"2020-07-07",null,null,"MORRINHOS"]
[]
[null,null,null,null,null,null,null,null,null,null,null,null,null,null,"CRE",null,null,"ENDEREÇO","REFERÊNCIA AGETOP",null,null,"REFERÊNCIA SINAPI"]
[null,null,null,null,null,null,null,null,null,null,null,null,null,null,"MORRINHOS",null,null,"RUA PIAUI 386, CENTRO, CEP:75650-000","ABR/19","DESONERADA",null,"NOV/19","DESONERADA"]
[]
[null,null,null,null,null,null,null,null,null,null,null,null,null,null,"ÁREA EXISTENTE (M²)",null,null,"ÁREA A CONSTRUIR (M²)","ÁREA A DEMOLIR (M²)",null,null,"ÁREA TOTAL CONSTRUÍDA (M²)"]
[null,null,null,null,null,null,null,null,null,null,null,null,null,null,2290.83,null,null,751.61,0,null,null,3042.44]
[]
[null,null,null,null,null,null,null,null,null,null,null,"FILTRO",null,null,"PLANILHA ORÇAMENTÁRIA"]
["Nível E","Save Nivel","Nível C","Altura","n1","n2","n3","n4","n5","Czero","Cnível","↓","Nível","Nível Corrigido","ITEM","TABELA","CODIGO","DESCRIÇÃO DOS SERVIÇOS","UNID","QUANT","MAT","MO","T.SERVIÇO","OBSERVAÇÕES¹"]
[{"$f":"CHOOSE(1+LOG(1+2*(ORÇAMENTO.Nivel=\"Nível 1\")+4*(ORÇAMENTO.Nivel=\"Nível 2\")+8*(ORÇAMENTO.Nivel=\"Nível 3\")+16*(ORÇAMENTO.Nivel=\"Nível 4\")+32*(ORÇAMENTO.Nivel=\"Serviço\"),2),0,1,2,3,4,\"S\")","v":"S"},{"$f":"IF(OR(C17=\"s\",C17=0),OFFSET(B17,-1,0),C17)","v":"Save Nivel"},{"$f":"IF(OFFSET(C17,-1,0)=\"L\",1,IF(OFFSET(C17,-1,0)=1,2,IF(OR(A17=\"s\",A17=0),\"S\",IF(AND(OFFSET(C17,-1,0)=2,A17=4),3,IF(AND(OR(OFFSET(C17,-1,0)=\"s\",OFFSET(C17,-1,0)=0),A17<>\"s\",A17>OFFSET(B17,-1,0)),OFFSET(B17,-1,0),A17)))))","v":"S"},{"$f":"IF(OR(C17=\"S\",C17=0),0,IF(ISERROR(K17),J17,SMALL(J17:K17,1)))","v":0},{"$f":"IF($C17=1,OFFSET(E17,-1,0)+1,OFFSET(E17,-1,0))","v":"n1"},{"$f":"IF($C17=1,0,IF($C17=2,OFFSET(F17,-1,0)+1,OFFSET(F17,-1,0)))","v":"n2"},{"$f":"IF(AND($C17<=2,$C17<>0),0,IF($C17=3,OFFSET(G17,-1,0)+1,OFFSET(G17,-1,0)))","v":"n3"},{"$f":"IF(AND($C17<=3,$C17<>0),0,IF($C17=4,OFFSET(H17,-1,0)+1,OFFSET(H17,-1,0)))","v":"n4"},{"$f":"IF(AND($C17<=4,$C17<>0),0,IF(AND($C17=\"S\",$W17>0),OFFSET(I17,-1,0)+1,OFFSET(I17,-1,0)))","v":"n5"},{"$f":"IF(OR($C17=\"S\",$C17=0),0,MATCH(0,OFFSET($D17,1,$C17,ROW($C$928)-ROW($C17)),0))","v":0},{"$f":"IF(OR($C17=\"S\",$C17=0),0,MATCH(OFFSET($D17,0,$C17)+1,OFFSET($D17,1,$C17,ROW($C$928)-ROW($C17)),0))","v":0},"","Serviço","Serviço","-","SINAPI",null,"(sem código)","-",null,0,0,0,""]
[0,null,"L",{"$f":"COUNTA(OFFSET(D18,1,0):D$928)","v":909},{"$f":"LEFT(O19,1)-1","v":0},null,null,null,null,null,null,"F","LOTE","LOTE","REFORMA - CENTRO DE ENSINO EM PERÍODO INTEGRAL SYLVIO DE MELLO",null,null,null,null,null,null,null,786551.21000000008]
[{"$f":"CHOOSE(1+LOG(1+2*(ORÇAMENTO.Nivel=\"Nível 1\")+4*(ORÇAMENTO.Nivel=\"Nível 2\")+8*(ORÇAMENTO.Nivel=\"Nível 3\")+16*(ORÇAMENTO.Nivel=\"Nível 4\")+32*(ORÇAMENTO.Nivel=\"Serviço\"),2),0,1,2,3,4,\"S\")","v":1},{"$f":"IF(OR(C19=\"s\",C19=0),OFFSET(B19,-1,0),C19)","v":1},{"$f":"IF(OFFSET(C19,-1,0)=\"L\",1,IF(OFFSET(C19,-1,0)=1,2,IF(OR(A19=\"s\",A19=0),\"S\",IF(AND(OFFSET(C19,-1,0)=2,A19=4),3,IF(AND(OR(OFFSET(C19,-1,0)=\"s\",OFFSET(C19,-1,0)=0),A19<>\"s\",A19>OFFSET(B19,-1,0)),OFFSET(B19,-1,0),A19)))))","v":1},{"$f":"IF(OR(C19=\"S\",C19=0),0,IF(ISERROR(K19),J19,SMALL(J19:K19,1)))","v":598},{"$f":"IF($C19=1,OFFSET(E19,-1,0)+1,OFFSET(E19,-1,0))","v":1},{"$f":"IF($C19=1,0,IF($C19=2,OFFSET(F19,-1,0)+1,OFFSET(F19,-1,0)))","v":0},{"$f":"IF(AND($C19<=2,$C19<>0),0,IF($C19=3,OFFSET(G19,-1,0)+1,OFFSET(G19,-1,0)))","v":0},{"$f":"IF(AND($C19<=3,$C19<>0),0,IF($C19=4,OFFSET(H19,-1,0)+1,OFFSET(H19,-1,0)))","v":0},{"$f":"IF(AND($C19<=4,$C19<>0),0,IF(AND($C19=\"S\",$W19>0),OFFSET(I19,-1,0)+1,OFFSET(I19,-1,0)))","v":0},{"$f":"IF(OR($C19=\"S\",$C19=0),0,MATCH(0,OFFSET($D19,1,$C19,ROW($C$928)-ROW($C19)),0))","v":909},{"$f":"IF(OR($C19=\"S\",$C19=0),0,MATCH(OFFSET($D19,0,$C19)+1,OFFSET($D19,1,$C19,ROW($C$928)-ROW($C19)),0))","v":598},"F","Nível 1","Nível 1","1.","AGETOP",null,"REFORMA"]
[{"$f":"CHOOSE(1+LOG(1+2*(ORÇAMENTO.Nivel=\"Nível 1\")+4*(ORÇAMENTO.Nivel=\"Nível 2\")+8*(ORÇAMENTO.Nivel=\"Nível 3\")+16*(ORÇAMENTO.Nivel=\"Nível 4\")+32*(ORÇAMENTO.Nivel=\"Serviço\"),2),0,1,2,3,4,\"S\")","v":2},{"$f":"IF(OR(C20=\"s\",C20=0),OFFSET(B20,-1,0),C20)","v":2},{"$f":"IF(OFFSET(C20,-1,0)=\"L\",1,IF(OFFSET(C20,-1,0)=1,2,IF(OR(A20=\"s\",A20=0),\"S\",IF(AND(OFFSET(C20,-1,0)=2,A20=4),3,IF(AND(OR(OFFSET(C20,-1,0)=\"s\",OFFSET(C20,-1,0)=0),A20<>\"s\",A20>OFFSET(B20,-1,0)),OFFSET(B20,-1,0),A20)))))","v":2},{"$f":"IF(OR(C20=\"S\",C20=0),0,IF(ISERROR(K20),J20,SMALL(J20:K20,1)))","v":59},{"$f":"IF($C20=1,OFFSET(E20,-1,0)+1,OFFSET(E20,-1,0))","v":1},{"$f":"IF($C20=1,0,IF($C20=2,OFFSET(F20,-1,0)+1,OFFSET(F20,-1,0)))","v":1},{"$f":"IF(AND($C20<=2,$C20<>0),0,IF($C20=3,OFFSET(G20,-1,0)+1,OFFSET(G20,-1,0)))","v":0},{"$f":"IF(AND($C20<=3,$C20<>0),0,IF($C20=4,OFFSET(H20,-1,0)+1,OFFSET(H20,-1,0)))","v":0},{"$f":"IF(AND($C20<=4,$C20<>0),0,IF(AND($C20=\"S\",$W20>0),OFFSET(I20,-1,0)+1,OFFSET(I20,-1,0)))","v":0},597,59,"F","Nível 2","Nível 2","1.1.","AGETOP",null,"SERVIÇOS PRELIMINARES"]
[{"$f":"CHOOSE(1+LOG(1+2*(ORÇAMENTO.Nivel=\"Nível 1\")+4*(ORÇAMENTO.Nivel=\"Nível 2\")+8*(ORÇAMENTO.Nivel=\"Nível 3\")+16*(ORÇAMENTO.Nivel=\"Nível 4\")+32*(ORÇAMENTO.Nivel=\"Serviço\"),2),0,1,2,3,4,\"S\")","v":3},{"$f":"IF(OR(C21=\"s\",C21=0),OFFSET(B21,-1,0),C21)","v":3},{"$f":"IF(OFFSET(C21,-1,0)=\"L\",1,IF(OFFSET(C21,-1,0)=1,2,IF(OR(A21=\"s\",A21=0),\"S\",IF(AND(OFFSET(C21,-1,0)=2,A21=4),3,IF(AND(OR(OFFSET(C21,-1,0)=\"s\",OFFSET(C21,-1,0)=0),A21<>\"s\",A21>OFFSET(B21,-1,0)),OFFSET(B21,-1,0),A21)))))","v":3},{"$f":"IF(OR(C21=\"S\",C21=0),0,IF(ISERROR(K21),J21,SMALL(J21:K21,1)))","v":5},{"$f":"IF($C21=1,OFFSET(E21,-1,0)+1,OFFSET(E21,-1,0))","v":1},{"$f":"IF($C21=1,0,IF($C21=2,OFFSET(F21,-1,0)+1,OFFSET(F21,-1,0)))","v":1},{"$f":"IF(AND($C21<=2,$C21<>0),0,IF($C21=3,OFFSET(G21,-1,0)+1,OFFSET(G21,-1,0)))","v":1},{"$f":"IF(AND($C21<=3,$C21<>0),0,IF($C21=4,OFFSET(H21,-1,0)+1,OFFSET(H21,-1,0)))","v":0},{"$f":"IF(AND($C21<=4,$C21<>0),0,IF(AND($C21=\"S\",$W21>0),OFFSET(I21,-1,0)+1,OFFSET(I21,-1,0)))","v":0},58,5,"F","Nível 3","Nível 3","1.1.1.","SINAPI",null,"1. REFORMA E AMPLIAÇÃO","-",null,null,null,null,""]
["S",3,"S",0,1,1,1,0,0,0,0,"F","Serviço","Serviço","1.1.1.0.1.","AGETOP",20155,"DEMOL.MURO/PAREDE PLACA PRÉ-MOLDADA C/TRANSP.C.B.E CARGA","m2    ",2.4,null,null,null,""]
["S",3,"S",0,1,1,1,0,0,0,0,"F","Serviço","Serviço","1.1.1.0.2.","SINAPI",98533,"PODA EM ALTURA DE ÁRVORE COM DIÂMETRO DE TRONCO MAIOR OU IGUAL A 0,20 M E MENOR QUE 0,40 M.AF_05/2018","UN",1,null,null,null,""]
["S",3,"S",0,1,1,1,0,0,0,0,"F","Serviço","Serviço","1.1.1.0.3.","SINAPI",98529,"CORTE RASO E RECORTE DE ÁRVORE COM DIÂMETRO DE TRONCO MAIOR OU IGUAL A 0,20 M E MENOR QUE 0,40 M.AF_05/2018","UN",1,null,null,null,""]
["S",3,"S",0,1,1,1,0,0,0,0,"F","Serviço","Serviço","1.1.1.0.4.","SINAPI",98526,"REMOÇÃO DE RAÍZES REMANESCENTES DE TRONCO DE ÁRVORE COM DIÂMETRO MAIOR OU IGUAL A 0,20 M E MENOR QUE 0,40 M.AF_05/2018","UN",1,null,null,null,""]
[3,3,3,7,1,1,2,0,0,53,7,"F","Nível 3","Nível 3","1.1.2.","SINAPI",null,"1.3 QUADRA DESCOBERTA","-",null,null,null,null,""]
["S",3,"S",0,1,1,2,0,0,0,0,"F","Serviço","Serviço","1.1.2.0.1.","AGETOP",20118,"DEM.ALVEN.TIJOLO S/REAP. C/TR.ATE CB. E CARGA","m3    ",12.1,null,null,null,""]
["S",3,"S",0,1,1,2,0,0,0,0,"F","Serviço","Serviço","1.1.2.0.2.","AGETOP",20121,"DEM. MANUAL EM CONCR.SIMPLES C/TR.ATE CB.E CARGA (O.C.)","m3    ",36.301499999999997,null,null,null,""]
["S",3,"S",0,1,1,2,0,0,0,0,"F","Serviço","Serviço","1.1.2.0.3.","COMPOSIÇÃO","COMP 385_SEE","DEMOLIÇÃO POSTE DE CONCRETO/METALICA ENTRE 10 E 15 METROS C/ REAPROVEITAMENTO C/ TRANSPORTE ATE CAÇAMBA E CARGA","UN ",4,null,null,null,""]
["S",3,"S",0,1,1,2,0,0,0,0,"F","Serviço","Serviço","1.1.2.0.4.","AGETOP",20155,"DEMOL.MURO/PAREDE PLACA PRÉ-MOLDADA C/TRANSP.C.B.E CARGA","m2    ",0.36,null,null,null,""]
["S",3,"S",0,1,1,2,0,0,0,0,"F","Serviço","Serviço","1.1.2.0.5.","AGETOP",20160,"DEMOLIÇÃO DE TELA DE ALAMBRADO C/ TRANSP. ATÉ CB. E CARGA","m2    ",42.4,null,null,null,""]
["S",3,"S",0,1,1,2,0,0,0,0,"F","Serviço","Serviço","1.1.2.0.6.","AGETOP",20106,"RETIRADA DE JANELAS OU PORTAIS C/ TRANSP. ATÉ CB. E CARGA","m2    ",10,null,null,null,""]
[{"$f":"CHOOSE(1+LOG(1+2*(ORÇAMENTO.Nivel=\"Nível 1\")+4*(ORÇAMENTO.Nivel=\"Nível 2\")+8*(ORÇAMENTO.Nivel=\"Nível 3\")+16*(ORÇAMENTO.Nivel=\"Nível 4\")+32*(ORÇAMENTO.Nivel=\"Serviço\"),2),0,1,2,3,4,\"S\")","v":3},{"$f":"IF(OR(C33=\"s\",C33=0),OFFSET(B33,-1,0),C33)","v":3},{"$f":"IF(OFFSET(C33,-1,0)=\"L\",1,IF(OFFSET(C33,-1,0)=1,2,IF(OR(A33=\"s\",A33=0),\"S\",IF(AND(OFFSET(C33,-1,0)=2,A33=4),3,IF(AND(OR(OFFSET(C33,-1,0)=\"s\",OFFSET(C33,-1,0)=0),A33<>\"s\",A33>OFFSET(B33,-1,0)),OFFSET(B33,-1,0),A33)))))","v":3},{"$f":"IF(OR(C33=\"S\",C33=0),0,IF(ISERROR(K33),J33,SMALL(J33:K33,1)))","v":10},{"$f":"IF($C33=1,OFFSET(E33,-1,0)+1,OFFSET(E33,-1,0))","v":1},{"$f":"IF($C33=1,0,IF($C33=2,OFFSET(F33,-1,0)+1,OFFSET(F33,-1,0)))","v":1},{"$f":"IF(AND($C33<=2,$C33<>0),0,IF($C33=3,OFFSET(G33,-1,0)+1,OFFSET(G33,-1,0)))","v":3},{"$f":"IF(AND($C33<=3,$C33<>0),0,IF($C33=4,OFFSET(H33,-1,0)+1,OFFSET(H33,-1,0)))","v":0},{"$f":"IF(AND($C33<=4,$C33<>0),0,IF(AND($C33=\"S\",$W33>0),OFFSET(I33,-1,0)+1,OFFSET(I33,-1,0)))","v":0},46,10,"F","Nível 3","Nível 3","1.1.3.","SINAPI",null,"3. VESTIÁRIOS FEMININO E MASCULINO","-",null,null,null,null,""]
["S",3,"S",0,1,1,3,0,0,0,0,"F","Serviço","Serviço","1.1.3.0.1.","AGETOP",20118,"DEM.ALVEN.TIJOLO S/REAP. C/TR.ATE CB. E CARGA","m3    ",6.3,null,null,null,""]
["S",3,"S",0,1,1,3,0,0,0,0,"F","Serviço","Serviço","1.1.3.0.2.","AGETOP",20106,"RETIRADA DE JANELAS OU PORTAIS C/ TRANSP. ATÉ CB. E CARGA","m2    ",16.38,null,null,null,""]
["S",3,"S",0,1,1,3,0,0,0,0,"F","Serviço","Serviço","1.1.3.0.3.","AGETOP",20112,"DEM.PISO CERAM. INCLUS. RETIRADA DE CONTRAPISO SOBRE LASTRO CONC.C/TR.CB.E CARGA","m2    ",68.66,null,null,null,""]
["S",3,"S",0,1,1,3,0,0,0,0,"F","Serviço","Serviço","1.1.3.0.4.","AGETOP",20115,"DEMOLIÇÃO DE REVESTIMENTOS COM AZULEJOS C/TRANSP.ATE CB. E CARGA","m2    ",268.95999999999998,null,null,null,""]
[{"$f":"CHOOSE(1+LOG(1+2*(ORÇAMENTO.Nivel=\"Nível 1\")+4*(ORÇAMENTO.Nivel=\"Nível 2\")+8*(ORÇAMENTO.Nivel=\"Nível 3\")+16*(ORÇAMENTO.Nivel=\"Nível 4\")+32*(ORÇAMENTO.Nivel=\"Serviço\"),2),0,1,2,3,4,\"S\")","v":"S"},{"$f":"IF(OR(C38=\"s\",C38=0),OFFSET(B38,-1,0),C38)","v":3},{"$f":"IF(OFFSET(C38,-1,0)=\"L\",1,IF(OFFSET(C38,-1,0)=1,2,IF(OR(A38=\"s\",A38=0),\"S\",IF(AND(OFFSET(C38,-1,0)=2,A38=4),3,IF(AND(OR(OFFSET(C38,-1,0)=\"s\",OFFSET(C38,-1,0)=0),A38<>\"s\",A38>OFFSET(B38,-1,0)),OFFSET(B38,-1,0),A38)))))","v":"S"},{"$f":"IF(OR(C38=\"S\",C38=0),0,IF(ISERROR(K38),J38,SMALL(J38:K38,1)))","v":0},{"$f":"IF($C38=1,OFFSET(E38,-1,0)+1,OFFSET(E38,-1,0))","v":1},{"$f":"IF($C38=1,0,IF($C38=2,OFFSET(F38,-1,0)+1,OFFSET(F38,-1,0)))","v":1},{"$f":"IF(AND($C38<=2,$C38<>0),0,IF($C38=3,OFFSET(G38,-1,0)+1,OFFSET(G38,-1,0)))","v":3},{"$f":"IF(AND($C38<=3,$C38<>0),0,IF($C38=4,OFFSET(H38,-1,0)+1,OFFSET(H38,-1,0)))","v":0},{"$f":"IF(AND($C38<=4,$C38<>0),0,IF(AND($C38=\"S\",$W38>0),OFFSET(I38,-1,0)+1,OFFSET(I38,-1,0)))","v":0},0,0,"F","Serviço","Serviço","1.1.3.0.5.","AGETOP",20140,"DEMOLIÇAO DE VÁLVULA DE DESCARGA C/ TRANSP. ATÉ CB. E CARGA","Un    ",5,null,null,null,""]
["S",3,"S",0,1,1,3,0,0,0,0,"F","Serviço","Serviço","1.1.3.0.6.","AGETOP",20137,"DEMOLIÇAO BACIA SANITARIA C/ TRANSP. ATÉ CB. E CARGA","Un    ",5,null,null,null,""]
["S",3,"S",0,1,1,3,0,0,0,0,"F","Serviço","Serviço","1.1.3.0.7.","AGETOP",20146,"DEMOLIÇÃO DE MICTÓRIO C/ TRANSP. ATÉ CB. E CARGA","Un    ",3,null,null,null,""]
["S",3,"S",0,1,1,3,0,0,0,0,"F","Serviço","Serviço","1.1.3.0.8.","AGETOP",20138,"DEMOLIÇAO DE LAVATÓRIO C/ TRANSP. ATÉ CB. E CARGA","Un    ",4,null,null,null,""]
["S",3,"S",0,1,1,3,0,0,0,0,"F","Serviço","Serviço","1.1.3.0.9.","AGETOP",20163,"DEMOLIÇÃO DAS INSTALAÇÕES HIDROSANITÁRIAS E AFINS C/ TRANSP. ATÉ CB. E CARGA","H     ",1,null,null,null,""]
[3,3,3,12,1,1,4,0,0,36,12,"F","Nível 3","Nível 3","1.1.4.","SINAPI",null,"4. COZINHA","-",null,null,null,null,""]
["S",3,"S",0,1,1,4,0,0,0,0,"F","Serviço","Serviço","1.1.4.0.1.","AGETOP",20118,"DEM.ALVEN.TIJOLO S/REAP. C/TR.ATE CB. E CARGA","m3    ",2.6999999999999997,null,null,null,""]
["S",3,"S",0,1,1,4,0,0,0,0,"F","Serviço","Serviço","1.1.4.0.2.","AGETOP",20121,"DEM. MANUAL EM CONCR.SIMPLES C/TR.ATE CB.E CARGA (O.C.)","m3    ",4.0729999999999995,null,null,null,""]
["S",3,"S",0,1,1,4,0,0,0,0,"F","Serviço","Serviço","1.1.4.0.3.","AGETOP",20112,"DEM.PISO CERAM. INCLUS. RETIRADA DE CONTRAPISO SOBRE LASTRO CONC.C/TR.CB.E CARGA","m2    ",14.85,null,null,null,""]
["S",3,"S",0,1,1,4,0,0,0,0,"F","Serviço","Serviço","1.1.4.0.4.","AGETOP",20115,"DEMOLIÇÃO DE REVESTIMENTOS COM AZULEJOS C/TRANSP.ATE CB. E CARGA","m2    ",88.35,null,null,null,""]
["S",3,"S",0,1,1,4,0,0,0,0,"F","Serviço","Serviço","1.1.4.0.5.","AGETOP",20139,"DEMOLIÇAO DE BANCADAS C/ TRANSP. ATÉ CB. E CARGA","m2    ",10.860000000000001,null,null,null,""]
[{"$f":"CHOOSE(1+LOG(1+2*(ORÇAMENTO.Nivel=\"Nível 1\")+4*(ORÇAMENTO.Nivel=\"Nível 2\")+8*(ORÇAMENTO.Nivel=\"Nível 3\")+16*(ORÇAMENTO.Nivel=\"Nível 4\")+32*(ORÇAMENTO.Nivel=\"Serviço\"),2),0,1,2,3,4,\"S\")","v":"S"},{"$f":"IF(OR(C49=\"s\",C49=0),OFFSET(B49,-1,0),C49)","v":3},{"$f":"IF(OFFSET(C49,-1,0)=\"L\",1,IF(OFFSET(C49,-1,0)=1,2,IF(OR(A49=\"s\",A49=0),\"S\",IF(AND(OFFSET(C49,-1,0)=2,A49=4),3,IF(AND(OR(OFFSET(C49,-1,0)=\"s\",OFFSET(C49,-1,0)=0),A49<>\"s\",A49>OFFSET(B49,-1,0)),OFFSET(B49,-1,0),A49)))))","v":"S"},{"$f":"IF(OR(C49=\"S\",C49=0),0,IF(ISERROR(K49),J49,SMALL(J49:K49,1)))","v":0},{"$f":"IF($C49=1,OFFSET(E49,-1,0)+1,OFFSET(E49,-1,0))","v":1},{"$f":"IF($C49=1,0,IF($C49=2,OFFSET(F49,-1,0)+1,OFFSET(F49,-1,0)))","v":1},{"$f":"IF(AND($C49<=2,$C49<>0),0,IF($C49=3,OFFSET(G49,-1,0)+1,OFFSET(G49,-1,0)))","v":4},{"$f":"IF(AND($C49<=3,$C49<>0),0,IF($C49=4,OFFSET(H49,-1,0)+1,OFFSET(H49,-1,0)))","v":0},{"$f":"IF(AND($C49<=4,$C49<>0),0,IF(AND($C49=\"S\",$W49>0),OFFSET(I49,-1,0)+1,OFFSET(I49,-1,0)))","v":0},0,0,"F","Serviço","Serviço","1.1.4.0.6.","AGETOP",20163,"DEMOLIÇÃO DAS INSTALAÇÕES HIDROSANITÁRIAS E AFINS C/ TRANSP. ATÉ CB. E CARGA","H     ",0.4,null,null,null,""]
["S",3,"S",0,1,1,4,0,0,0,0,"F","Serviço","Serviço","1.1.4.0.7.","AGETOP",20106,"RETIRADA DE JANELAS OU PORTAIS C/ TRANSP. ATÉ CB. E CARGA","m2    ",21.439999999999998,null,null,null,""]
["S",3,"S",0,1,1,4,0,0,0,0,"F","Serviço","Serviço","1.1.4.0.8.","AGETOP",20147,"DEMOLIÇÃO DE FORRO PVC  INCLUSIVE ESTRUTURA DE SUSTENTAÇÃO C/ TRANSP. ATÉ CB. E CARGA","m2    ",146.61000000000001,null,null,null,""]
["S",3,"S",0,1,1,4,0,0,0,0,"F","Serviço","Serviço","1.1.4.0.9.","AGETOP",20137,"DEMOLIÇAO BACIA SANITARIA C/ TRANSP. ATÉ CB. E CARGA","Un    ",1,null,null,null,""]
["S",3,"S",0,1,1,4,0,0,0,0,"F","Serviço","Serviço","1.1.4.0.10.","AGETOP",20140,"DEMOLIÇAO DE VÁLVULA DE DESCARGA C/ TRANSP. ATÉ CB. E CARGA","Un    ",1,null,null,null,""]
["S",3,"S",0,1,1,4,0,0,0,0,"F","Serviço","Serviço","1.1.4.0.11.","AGETOP",20138,"DEMOLIÇAO DE LAVATÓRIO C/ TRANSP. ATÉ CB. E CARGA","Un    ",1,null,null,null,""]
[3,3,3,2,1,1,5,0,0,24,2,"F","Nível 3","Nível 3","1.1.5.","SINAPI",null,"4.1 REFEITÓRIO","-",null,null,null,null,""]
["S",3,"S",0,1,1,5,0,0,0,0,"F","Serviço","Serviço","1.1.5.0.1.","AGETOP",20115,"DEMOLIÇÃO DE REVESTIMENTOS COM AZULEJOS C/TRANSP.ATE CB. E CARGA","m2    ",20,null,null,null,""]
[3,3,3,2,1,1,6,0,0,22,2,"F","Nível 3","Nível 3","1.1.6.","SINAPI",null,"5. RAMPA","-",null,null,null,null,""]
["S",3,"S",0,1,1,6,0,0,0,0,"F","Serviço","Serviço","1.1.6.0.1.","AGETOP",20112,"DEM.PISO CERAM. INCLUS. RETIRADA DE CONTRAPISO SOBRE LASTRO CONC.C/TR.CB.E CARGA","m2    ",15.5,null,null,null,""]
[3,3,3,9,1,1,7,0,0,20,9,"F","Nível 3","Nível 3","1.1.7.","SINAPI",null,"6. SANITÁRIOS FEMININO E MASCULINO","-",null,null,null,null,""]
["S",3,"S",0,1,1,7,0,0,0,0,"F","Serviço","Serviço","1.1.7.0.1.","AGETOP",20118,"DEM.ALVEN.TIJOLO S/REAP. C/TR.ATE CB. E CARGA","m3    ",3.48,null,null,null,""]
["S",3,"S",0,1,1,7,0,0,0,0,"F","Serviço","Serviço","1.1.7.0.2.","AGETOP",20106,"RETIRADA DE JANELAS OU PORTAIS C/ TRANSP. ATÉ CB. E CARGA","m2    ",2.52,null,null,null,""]
["S",3,"S",0,1,1,7,0,0,0,0,"F","Serviço","Serviço","1.1.7.0.3.","AGETOP",20112,"DEM.PISO CERAM. INCLUS. RETIRADA DE CONTRAPISO SOBRE LASTRO CONC.C/TR.CB.E CARGA","m2    ",64,null,null,null,""]
["S",3,"S",0,1,1,7,0,0,0,0,"F","Serviço","Serviço","1.1.7.0.4.","AGETOP",20115,"DEMOLIÇÃO DE REVESTIMENTOS COM AZULEJOS C/TRANSP.ATE CB. E CARGA","m2    ",145,null,null,null,""]
["S",3,"S",0,1,1,7,0,0,0,0,"F","Serviço","Serviço","1.1.7.0.5.","AGETOP",20137,"DEMOLIÇAO BACIA SANITARIA C/ TRANSP. ATÉ CB. E CARGA","Un    ",12,null,null,null,""]
["S",3,"S",0,1,1,7,0,0,0,0,"F","Serviço","Serviço","1.1.7.0.6.","AGETOP",20146,"DEMOLIÇÃO DE MICTÓRIO C/ TRANSP. ATÉ CB. E CARGA","Un    ",3,null,null,null,""]
["S",3,"S",0,1,1,7,0,0,0,0,"F","Serviço","Serviço","1.1.7.0.7.","AGETOP",20138,"DEMOLIÇAO DE LAVATÓRIO C/ TRANSP. ATÉ CB. E CARGA","Un    ",9,null,null,null,""]
["S",3,"S",0,1,1,7,0,0,0,0,"F","Serviço","Serviço","1.1.7.0.8.","AGETOP",20163,"DEMOLIÇÃO DAS INSTALAÇÕES HIDROSANITÁRIAS E AFINS C/ TRANSP. ATÉ CB. E CARGA","H     ",0.5,null,null,null,""]
[3,3,3,2,1,1,8,0,0,11,2,"F","Nível 3","Nível 3","1.1.8.","SINAPI",null,"7. PISO TÁTIL","-",null,null,null,null,""]
["S",3,"S",0,1,1,8,0,0,0,0,"F","Serviço","Serviço","1.1.8.0.1.","AGETOP",67010,"ESCARIFICAÇÃO MANUAL, CORTE DE CONCRETO ATÉ 3CM DE PROFUNDIDADE","m3    ",0.80680000000000007,null,null,null,""]
[3,3,3,4,1,1,9,0,0,9,4,"F","Nível 3","Nível 3","1.1.9.","SINAPI",null,"8. CENTRAL DE GÁS","-",null,null,null,null,""]
["S",3,"S",0,1,1,9,0,0,0,0,"F","Serviço","Serviço","1.1.9.0.1.","AGETOP",20118,"DEM.ALVEN.TIJOLO S/REAP. C/TR.ATE CB. E CARGA","m3    ",0.5,null,null,null,""]
["S",3,"S",0,1,1,9,0,0,0,0,"F","Serviço","Serviço","1.1.9.0.2.","AGETOP",20121,"DEM. MANUAL EM CONCR.SIMPLES C/TR.ATE CB.E CARGA (O.C.)","m3    ",0.06,null,null,null,""]
["S",3,"S",0,1,1,9,0,0,0,0,"F","Serviço","Serviço","1.1.9.0.3.","AGETOP",20106,"RETIRADA DE JANELAS OU PORTAIS C/ TRANSP. ATÉ CB. E CARGA","m2    ",3.6,null,null,null,""]
[3,3,3,2,1,1,10,0,0,5,2,"F","Nível 3","Nível 3","1.1.10.","SINAPI",null,"11. PREVENÇÃO E COMBATE A INCÊNDIO","-",null,null,null,null,""]
["S",3,"S",0,1,1,10,0,0,0,0,"F","Serviço","Serviço","1.1.10.0.1.","AGETOP",20121,"DEM. MANUAL EM CONCR.SIMPLES C/TR.ATE CB.E CARGA (O.C.)","m3    ",2.379,null,null,null,""]
[3,3,3,3,1,1,11,0,0,3,{"$error":"#N/A"},"F","Nível 3","Nível 3","1.1.11.","SINAPI",null,"OUTROS","-",null,null,null,null,""]
["S",3,"S",0,1,1,11,0,0,0,0,"F","Serviço","Serviço","1.1.11.0.1.","AGETOP",20162,"DEMOLIÇÃO DAS INSTALAÇÕES ELÉTRICAS E AFINS C/ TRANSP. ATÉ CB. E CARGA","H     ",5,null,null,null,""]
["S",3,"S",0,1,1,11,0,0,0,0,"F","Serviço","Serviço","1.1.11.0.2.","AGETOP",21301,"PLACA DE OBRA PLOTADA EM CHAPA METÁLICA 26 , AFIXADA EM CAVALETES DE MADEIRA DE LEI (VIGOTAS 6X12CM) - PADRÃO GOINFRA","m2    ",7.5,null,null,null,""]
[2,2,2,3,1,2,0,0,0,538,3,"F","Nível 2","Nível 2","1.2.","AGETOP",null,"TRANSPORTES","-",null,null,null,null,""]
["S",2,"S",0,1,2,0,0,0,0,0,"F","Serviço","Serviço","1.2.0.0.1.","SINAPI",72900,"TRANSPORTE DE ENTULHO COM CAMINHAO BASCULANTE 6 M3, RODOVIA PAVIMENTADA, DMT 0,5 A 1,0 KM","M3",80.006699999999995,null,null,null,""]
["S",2,"S",0,1,2,0,0,0,0,0,"F","Serviço","Serviço","1.2.0.0.2.","SINAPI",72897,"CARGA MANUAL DE ENTULHO EM CAMINHAO BASCULANTE 6 M3","M3",80.006699999999995,null,null,null,""]
[2,2,2,16,1,3,0,0,0,535,16,"F","Nível 2","Nível 2","1.3.","AGETOP",null,"SERVIÇO EM TERRA","-",null,null,null,null,""]
[3,3,3,5,1,3,1,0,0,{"$f":"IF(OR($C83=\"S\",$C83=0),0,MATCH(0,OFFSET($D83,1,$C83,ROW($C$928)-ROW($C83)),0))","v":15},{"$f":"IF(OR($C83=\"S\",$C83=0),0,MATCH(OFFSET($D83,0,$C83)+1,OFFSET($D83,1,$C83,ROW($C$928)-ROW($C83)),0))","v":5},"F","Nível 3","Nível 3","1.3.1.","SINAPI",null,"1. REFORMA E AMPLIAÇÃO","-",null,null,null,null,""]
["S",3,"S",0,1,3,1,0,0,0,0,"F","Serviço","Serviço","1.3.1.0.1.","SINAPI",79480,"ESCAVACAO MECANICA CAMPO ABERTO EM SOLO EXCETO ROCHA ATE 2,00M PROFUNDIDADE","M3",96.5,null,null,null,"Referência: AGETOP - 41004"]
["S",3,"S",0,1,3,1,0,0,0,0,"F","Serviço","Serviço","1.3.1.0.2.","AGETOP",41005,"CARGA MECANIZADA","m3    ",96.5,null,null,null,""]
["S",3,"S",0,1,3,1,0,0,0,0,"F","Serviço","Serviço","1.3.1.0.3.","AGETOP",41140,"REGULARIZAÇÃO DO TERRENO SEM APILOAMENTO COM TRANSPORTE MANUAL DA TERRA ESCAVADA ","m2    ",172,null,null,null,""]
["S",3,"S",0,1,3,1,0,0,0,0,"F","Serviço","Serviço","1.3.1.0.4.","AGETOP",41002,"APILOAMENTO","m2    ",172,null,null,null,""]
[3,3,3,4,1,3,2,0,0,10,4,"F","Nível 3","Nível 3","1.3.2.","SINAPI",null,"1.3 QUADRA DESCOBERTA","-",null,null,null,null,""]
["S",3,"S",0,1,3,2,0,0,0,0,"F","Serviço","Serviço","1.3.2.0.1.","AGETOP",41140,"REGULARIZAÇÃO DO TERRENO SEM APILOAMENTO COM TRANSPORTE MANUAL DA TERRA ESCAVADA ","m2    ",781.06,null,null,null,""]
["S",3,"S",0,1,3,2,0,0,0,0,"F","Serviço","Serviço","1.3.2.0.2.","AGETOP",41010,"TRANSPORTE COM LÂMINA ATE 100 M - (OBRAS CIVIS)","m3    ",7.65,null,null,null,""]
["S",3,"S",0,1,3,2,0,0,0,0,"F","Serviço","Serviço","1.3.2.0.3.","AGETOP",41002,"APILOAMENTO","m2    ",707,null,null,null,""]
[3,3,3,3,1,3,3,0,0,6,3,"F","Nível 3","Nível 3","1.3.3.","SINAPI",null,"2. RAMPA E ESCADA","-",null,null,null,null,""]
["S",3,"S",0,1,3,3,0,0,0,0,"F","Serviço","Serviço","1.3.3.0.1.","AGETOP",41010,"TRANSPORTE COM LÂMINA ATE 100 M - (OBRAS CIVIS)","m3    ",4.25,null,null,null,""]
["S",3,"S",0,1,3,3,0,0,0,0,"F","Serviço","Serviço","1.3.3.0.2.","AGETOP",41002,"APILOAMENTO","m2    ",18,null,null,null,""]
[3,3,3,3,1,3,4,0,0,3,229,"F","Nível 3","Nível 3","1.3.4.","SINAPI",null,"8. CENTRAL DE GÁS","-",null,null,null,null,""]
["S",3,"S",0,1,3,4,0,0,0,0,"F","Serviço","Serviço","1.3.4.0.1.","AGETOP",41140,"REGULARIZAÇÃO DO TERRENO SEM APILOAMENTO COM TRANSPORTE MANUAL DA TERRA ESCAVADA ","m2    ",1.53,null,null,null,""]
["S",3,"S",0,1,3,4,0,0,0,0,"F","Serviço","Serviço","1.3.4.0.2.","AGETOP",41002,"APILOAMENTO","m2    ",7.24,null,null,null,""]
[2,2,2,63,1,4,0,0,0,519,63,"F","Nível 2","Nível 2","1.4.","SINAPI",null,"ESTRUTURA","-",null,null,null,null,""]
[3,3,3,2,1,4,1,0,0,62,2,"F","Nível 3","Nível 3","1.4.1.","SINAPI",null,"4. COZINHA","-",null,null,null,null,""]
["S",3,"S",0,1,4,1,0,0,0,0,"F","Serviço","Serviço","1.4.1.0.1.","AGETOP",60010,"VERGA/CONTRAVERGA EM CONCRETO ARMADO FCK = 20 MPA","m3    ",0.63,null,null,null,""]
[3,3,3,21,1,4,2,0,0,60,21,"F","Nível 3","Nível 3","1.4.2.","SINAPI",null,"MURO DE ARRIMO","-",null,null,null,null,""]
[{"$f":"CHOOSE(1+LOG(1+2*(ORÇAMENTO.Nivel=\"Nível 1\")+4*(ORÇAMENTO.Nivel=\"Nível 2\")+8*(ORÇAMENTO.Nivel=\"Nível 3\")+16*(ORÇAMENTO.Nivel=\"Nível 4\")+32*(ORÇAMENTO.Nivel=\"Serviço\"),2),0,1,2,3,4,\"S\")","v":4},4,4,4,1,4,2,1,0,20,4,"F","Nível 4","Nível 4","1.4.2.1.","SINAPI",null,"ESTACAS","-",null,null,null,null,""]
["S",4,"S",0,1,4,2,1,0,0,0,"F","Serviço","Serviço","1.4.2.1.1.","AGETOP",50302,"ESTACA A TRADO DIAM.30 CM SEM FERRO","M     ",9,null,null,null,""]
["S",4,"S",0,1,4,2,1,0,0,0,"F","Serviço","Serviço","1.4.2.1.2.","AGETOP",60314,"ACO CA - 60 - 5,0 MM - (OBRAS CIVIS)","Kg    ",7.18,null,null,null,""]
["S",4,"S",0,1,4,2,1,0,0,0,"F","Serviço","Serviço","1.4.2.1.3.","AGETOP",52005,"ACO CA-50A - 10,0 MM (3/8\") - (OBRAS CIVIS)","Kg    ",40.54,null,null,null,""]
[4,4,4,7,1,4,2,2,0,16,7,"F","Nível 4","Nível 4","1.4.2.2.","SINAPI",null,"BLOCOS","-",null,null,null,null,""]
["S",4,"S",0,1,4,2,2,0,0,0,"F","Serviço","Serviço","1.4.2.2.1.","AGETOP",40101,"ESCAVACAO MANUAL DE VALAS < 1 MTS. (OBRAS CIVIS)","m3    ",1.8499999999999999,null,null,null,""]
["S",4,"S",0,1,4,2,2,0,0,0,"F","Serviço","Serviço","1.4.2.2.2.","AGETOP",41002,"APILOAMENTO","m2    ",3.2399999999999998,null,null,null,""]
["S",4,"S",0,1,4,2,2,0,0,0,"F","Serviço","Serviço","1.4.2.2.3.","SINAPI",96616,"LASTRO DE CONCRETO MAGRO, APLICADO EM BLOCOS DE COROAMENTO OU SAPATAS. AF_08/2017","M3",0.16,null,null,null,""]
["S",4,"S",0,1,4,2,2,0,0,0,"F","Serviço","Serviço","1.4.2.2.4.","AGETOP",51030,"PREPARO COM BETONEIRA E TRANSPORTE MANUAL DE CONCRETO FCK=25 MPA","m3    ",1.69,null,null,null,""]
["S",4,"S",0,1,4,2,2,0,0,0,"F","Serviço","Serviço","1.4.2.2.5.","AGETOP",51055,"LANÇAMENTO/APLICAÇÃO/ADENSAMENTO MANUAL DE CONCRETO - (O.C.)","m3    ",1.69,null,null,null,""]
["S",4,"S",0,1,4,2,2,0,0,0,"F","Serviço","Serviço","1.4.2.2.6.","AGETOP",60314,"ACO CA - 60 - 5,0 MM - (OBRAS CIVIS)","Kg    ",20.9,null,null,null,""]
[4,4,4,9,1,4,2,3,0,9,146,"F","Nível 4","Nível 4","1.4.2.3.","SINAPI",null,"VIGAS BALDRAMES","-",null,null,null,null,""]
["S",4,"S",0,1,4,2,3,0,0,0,"F","Serviço","Serviço","1.4.2.3.1.","AGETOP",40101,"ESCAVACAO MANUAL DE VALAS < 1 MTS. (OBRAS CIVIS)","m3    ",1.72,null,null,null,""]
["S",4,"S",0,1,4,2,3,0,0,0,"F","Serviço","Serviço","1.4.2.3.2.","AGETOP",41002,"APILOAMENTO","m2    ",2.46,null,null,null,""]
["S",4,"S",0,1,4,2,3,0,0,0,"F","Serviço","Serviço","1.4.2.3.3.","AGETOP",40902,"REATERRO COM APILOAMENTO","m3    ",0.98,null,null,null,""]
["S",4,"S",0,1,4,2,3,0,0,0,"F","Serviço","Serviço","1.4.2.3.4.","AGETOP",60191,"FORMA DE TABUA CINTA BALDRAME U=8 VEZES","m2    ",12.26,null,null,null,""]
["S",4,"S",0,1,4,2,3,0,0,0,"F","Serviço","Serviço","1.4.2.3.5.","AGETOP",51030,"PREPARO COM BETONEIRA E TRANSPORTE MANUAL DE CONCRETO FCK=25 MPA","m3    ",0.74,null,null,null,""]
["S",4,"S",0,1,4,2,3,0,0,0,"F","Serviço","Serviço","1.4.2.3.6.","AGETOP",51055,"LANÇAMENTO/APLICAÇÃO/ADENSAMENTO MANUAL DE CONCRETO - (O.C.)","m3    ",0.74,null,null,null,""]
["S",4,"S",0,1,4,2,3,0,0,0,"F","Serviço","Serviço","1.4.2.3.7.","AGETOP",52004,"ACO CA 50-A - 8,0 MM (5/16\") - (OBRAS CIVIS)","Kg    ",26.36,null,null,null,""]
["S",4,"S",0,1,4,2,3,0,0,0,"F","Serviço","Serviço","1.4.2.3.8.","AGETOP",52014,"ACO CA-60 - 5,0 MM - (OBRAS CIVIS)","Kg    ",12.45,null,null,null,""]
[3,3,3,21,1,4,3,0,0,39,21,"F","Nível 3","Nível 3","1.4.3.","SINAPI",null,"COZINHA","-",null,null,null,null,""]
[4,4,4,4,1,4,3,1,0,20,4,"F","Nível 4","Nível 4","1.4.3.1.","SINAPI",null,"ESTACAS","-",null,null,null,null,""]
["S",4,"S",0,1,4,3,1,0,0,0,"F","Serviço","Serviço","1.4.3.1.1.","AGETOP",50302,"ESTACA A TRADO DIAM.30 CM SEM FERRO","M     ",24,null,null,null,""]
["S",4,"S",0,1,4,3,1,0,0,0,"F","Serviço","Serviço","1.4.3.1.2.","AGETOP",60314,"ACO CA - 60 - 5,0 MM - (OBRAS CIVIS)","Kg    ",27,null,null,null,""]
["S",4,"S",0,1,4,3,1,0,0,0,"F","Serviço","Serviço","1.4.3.1.3.","AGETOP",52005,"ACO CA-50A - 10,0 MM (3/8\") - (OBRAS CIVIS)","Kg    ",72,null,null,null,""]
[4,4,4,7,1,4,3,2,0,16,7,"F","Nível 4","Nível 4","1.4.3.2.","SINAPI",null,"BLOCOS","-",null,null,null,null,""]
["S",4,"S",0,1,4,3,2,0,0,0,"F","Serviço","Serviço","1.4.3.2.1.","AGETOP",40101,"ESCAVACAO MANUAL DE VALAS < 1 MTS. (OBRAS CIVIS)","m3    ",2.46,null,null,null,""]
["S",4,"S",0,1,4,3,2,0,0,0,"F","Serviço","Serviço","1.4.3.2.2.","AGETOP",41002,"APILOAMENTO","m2    ",4.32,null,null,null,""]
["S",4,"S",0,1,4,3,2,0,0,0,"F","Serviço","Serviço","1.4.3.2.3.","SINAPI",96616,"LASTRO DE CONCRETO MAGRO, APLICADO EM BLOCOS DE COROAMENTO OU SAPATAS. AF_08/2017","M3",0.21,null,null,null,""]
["S",4,"S",0,1,4,3,2,0,0,0,"F","Serviço","Serviço","1.4.3.2.4.","AGETOP",51030,"PREPARO COM BETONEIRA E TRANSPORTE MANUAL DE CONCRETO FCK=25 MPA","m3    ",2.25,null,null,null,""]
["S",4,"S",0,1,4,3,2,0,0,0,"F","Serviço","Serviço","1.4.3.2.5.","AGETOP",51055,"LANÇAMENTO/APLICAÇÃO/ADENSAMENTO MANUAL DE CONCRETO - (O.C.)","m3    ",2.25,null,null,null,""]
["S",4,"S",0,1,4,3,2,0,0,0,"F","Serviço","Serviço","1.4.3.2.6.","AGETOP",60314,"ACO CA - 60 - 5,0 MM - (OBRAS CIVIS)","Kg    ",27.81,null,null,null,""]
[4,4,4,9,1,4,3,3,0,9,125,"F","Nível 4","Nível 4","1.4.3.3.","SINAPI",null,"VIGAS BALDRAMES","-",null,null,null,null,""]
["S",4,"S",0,1,4,3,3,0,0,0,"F","Serviço","Serviço","1.4.3.3.1.","AGETOP",40101,"ESCAVACAO MANUAL DE VALAS < 1 MTS. (OBRAS CIVIS)","m3    ",2.52,null,null,null,""]
["S",4,"S",0,1,4,3,3,0,0,0,"F","Serviço","Serviço","1.4.3.3.2.","AGETOP",41002,"APILOAMENTO","m2    ",3.08,null,null,null,""]
["S",4,"S",0,1,4,3,3,0,0,0,"F","Serviço","Serviço","1.4.3.3.3.","AGETOP",40902,"REATERRO COM APILOAMENTO","m3    ",1.44,null,null,null,""]
["S",4,"S",0,1,4,3,3,0,0,0,"F","Serviço","Serviço","1.4.3.3.4.","AGETOP",60191,"FORMA DE TABUA CINTA BALDRAME U=8 VEZES","m2    ",17.43,null,null,null,""]
["S",4,"S",0,1,4,3,3,0,0,0,"F","Serviço","Serviço","1.4.3.3.5.","AGETOP",51030,"PREPARO COM BETONEIRA E TRANSPORTE MANUAL DE CONCRETO FCK=25 MPA","m3    ",1.08,null,null,null,""]
["S",4,"S",0,1,4,3,3,0,0,0,"F","Serviço","Serviço","1.4.3.3.6.","AGETOP",51055,"LANÇAMENTO/APLICAÇÃO/ADENSAMENTO MANUAL DE CONCRETO - (O.C.)","m3    ",1.08,null,null,null,""]
["S",4,"S",0,1,4,3,3,0,0,0,"F","Serviço","Serviço","1.4.3.3.7.","AGETOP",52004,"ACO CA 50-A - 8,0 MM (5/16\") - (OBRAS CIVIS)","Kg    ",33.36,null,null,null,""]
["S",4,"S",0,1,4,3,3,0,0,0,"F","Serviço","Serviço","1.4.3.3.8.","AGETOP",52014,"ACO CA-60 - 5,0 MM - (OBRAS CIVIS)","Kg    ",13,null,null,null,""]
[3,3,3,18,1,4,4,0,0,18,181,"F","Nível 3","Nível 3","1.4.4.","SINAPI",null,"BANHEIRO","-",null,null,null,null,""]
[4,4,4,7,1,4,4,1,0,17,7,"F","Nível 4","Nível 4","1.4.4.1.","SINAPI",null,"BLOCOS","-",null,null,null,null,""]
["S",4,"S",0,1,4,4,1,0,0,0,"F","Serviço","Serviço","1.4.4.1.1.","AGETOP",40101,"ESCAVACAO MANUAL DE VALAS < 1 MTS. (OBRAS CIVIS)","m3    ",1.512,null,null,null,""]
["S",4,"S",0,1,4,4,1,0,0,0,"F","Serviço","Serviço","1.4.4.1.2.","AGETOP",41002,"APILOAMENTO","m2    ",2.52,null,null,null,""]
["S",4,"S",0,1,4,4,1,0,{"$f":"IF(OR($C147=\"S\",$C147=0),0,MATCH(0,OFFSET($D147,1,$C147,ROW($C$928)-ROW($C147)),0))","v":0},{"$f":"IF(OR($C147=\"S\",$C147=0),0,MATCH(OFFSET($D147,0,$C147)+1,OFFSET($D147,1,$C147,ROW($C$928)-ROW($C147)),0))","v":0},"F","Serviço","Serviço","1.4.4.1.3.","SINAPI",96616,"LASTRO DE CONCRETO MAGRO, APLICADO EM BLOCOS DE COROAMENTO OU SAPATAS. AF_08/2017","M3",0.126,null,null,null,""]
["S",4,"S",0,1,4,4,1,0,0,0,"F","Serviço","Serviço","1.4.4.1.4.","AGETOP",51030,"PREPARO COM BETONEIRA E TRANSPORTE MANUAL DE CONCRETO FCK=25 MPA","m3    ",1.31,null,null,null,""]
["S",4,"S",0,1,4,4,1,0,0,0,"F","Serviço","Serviço","1.4.4.1.5.","AGETOP",51055,"LANÇAMENTO/APLICAÇÃO/ADENSAMENTO MANUAL DE CONCRETO - (O.C.)","m3    ",1.31,null,null,null,""]
["S",4,"S",0,1,4,4,1,0,0,0,"F","Serviço","Serviço","1.4.4.1.6.","AGETOP",60314,"ACO CA - 60 - 5,0 MM - (OBRAS CIVIS)","Kg    ",16.27272727272727,null,null,null,""]
[4,4,4,10,1,4,4,2,0,10,37,"F","Nível 4","Nível 4","1.4.4.2.","SINAPI",null,"VIGAS BALDRAMES","-",null,null,null,null,""]
["S",{"$f":"IF(OR(C152=\"s\",C152=0),OFFSET(B152,-1,0),C152)","v":4},{"$f":"IF(OFFSET(C152,-1,0)=\"L\",1,IF(OFFSET(C152,-1,0)=1,2,IF(OR(A152=\"s\",A152=0),\"S\",IF(AND(OFFSET(C152,-1,0)=2,A152=4),3,IF(AND(OR(OFFSET(C152,-1,0)=\"s\",OFFSET(C152,-1,0)=0),A152<>\"s\",A152>OFFSET(B152,-1,0)),OFFSET(B152,-1,0),A152)))))","v":"S"},{"$f":"IF(OR(C152=\"S\",C152=0),0,IF(ISERROR(K152),J152,SMALL(J152:K152,1)))","v":0},{"$f":"IF($C152=1,OFFSET(E152,-1,0)+1,OFFSET(E152,-1,0))","v":1},{"$f":"IF($C152=1,0,IF($C152=2,OFFSET(F152,-1,0)+1,OFFSET(F152,-1,0)))","v":4},{"$f":"IF(AND($C152<=2,$C152<>0),0,IF($C152=3,OFFSET(G152,-1,0)+1,OFFSET(G152,-1,0)))","v":4},{"$f":"IF(AND($C152<=3,$C152<>0),0,IF($C152=4,OFFSET(H152,-1,0)+1,OFFSET(H152,-1,0)))","v":2},{"$f":"IF(AND($C152<=4,$C152<>0),0,IF(AND($C152=\"S\",$W152>0),OFFSET(I152,-1,0)+1,OFFSET(I152,-1,0)))","v":0},0,0,"F","Serviço","Serviço","1.4.4.2.1.","AGETOP",40101,"ESCAVACAO MANUAL DE VALAS < 1 MTS. (OBRAS CIVIS)","m3    ",1.3066666666666669,null,null,null,""]
["S",4,"S",0,1,4,4,2,0,0,0,"F","Serviço","Serviço","1.4.4.2.2.","AGETOP",41002,"APILOAMENTO","m2    ",2.2400000000000002,null,null,null,""]
["S",4,"S",0,1,4,4,2,0,0,0,"F","Serviço","Serviço","1.4.4.2.3.","AGETOP",40902,"REATERRO COM APILOAMENTO","m3    ",0.74666666666666681,null,null,null,""]
["S",4,"S",0,1,4,4,2,0,0,0,"F","Serviço","Serviço","1.4.4.2.4.","AGETOP",60191,"FORMA DE TABUA CINTA BALDRAME U=8 VEZES","m2    ",9.76,null,null,null,""]
["S",4,"S",0,1,4,4,2,0,0,0,"F","Serviço","Serviço","1.4.4.2.5.","AGETOP",51030,"PREPARO COM BETONEIRA E TRANSPORTE MANUAL DE CONCRETO FCK=25 MPA","m3    ",0.56000000000000005,null,null,null,""]
["S",4,"S",0,1,4,4,2,0,0,0,"F","Serviço","Serviço","1.4.4.2.6.","AGETOP",51055,"LANÇAMENTO/APLICAÇÃO/ADENSAMENTO MANUAL DE CONCRETO - (O.C.)","m3    ",0.56000000000000005,null,null,null,""]
["S",4,"S",0,1,4,4,2,0,0,0,"F","Serviço","Serviço","1.4.4.2.7.","AGETOP",52004,"ACO CA 50-A - 8,0 MM (5/16\") - (OBRAS CIVIS)","Kg    ",17.18181818181818,null,null,null,""]
["S",4,"S",0,1,4,4,2,0,0,0,"F","Serviço","Serviço","1.4.4.2.8.","AGETOP",52005,"ACO CA-50A - 10,0 MM (3/8\") - (OBRAS CIVIS)","Kg    ",10.999999999999998,null,null,null,""]
["S",4,"S",0,1,4,4,2,0,0,0,"F","Serviço","Serviço","1.4.4.2.9.","AGETOP",52014,"ACO CA-60 - 5,0 MM - (OBRAS CIVIS)","Kg    ",11.363636363636363,null,null,null,""]
[2,2,2,44,1,5,0,0,0,456,44,"F","Nível 2","Nível 2","1.5.","SINAPI",null,"ESTRUTURA","-",null,null,null,null,""]
[3,3,3,13,1,5,1,0,0,43,13,"F","Nível 3","Nível 3","1.5.1.","SINAPI",null,"MURO DE ARRIMO","-",null,null,null,null,""]
[4,4,4,6,1,5,1,1,0,12,6,"F","Nível 4","Nível 4","1.5.1.1.","SINAPI",null,"PILARES","-",null,null,null,null,""]
["S",4,"S",0,1,5,1,1,0,0,0,"F","Serviço","Serviço","1.5.1.1.1.","AGETOP",60209,"FORMA CH.COMPENSADA 12MM-VIGA/PILAR U=4V - (OBRAS CIVIS","m2    ",16.420000000000002,null,null,null,""]
["S",4,"S",0,1,5,1,1,0,0,0,"F","Serviço","Serviço","1.5.1.1.2.","AGETOP",51030,"PREPARO COM BETONEIRA E TRANSPORTE MANUAL DE CONCRETO FCK=25 MPA","m3    ",0.77,null,null,null,""]
[{"$f":"CHOOSE(1+LOG(1+2*(ORÇAMENTO.Nivel=\"Nível 1\")+4*(ORÇAMENTO.Nivel=\"Nível 2\")+8*(ORÇAMENTO.Nivel=\"Nível 3\")+16*(ORÇAMENTO.Nivel=\"Nível 4\")+32*(ORÇAMENTO.Nivel=\"Serviço\"),2),0,1,2,3,4,\"S\")","v":"S"},4,"S",0,1,5,1,1,0,0,0,"F","Serviço","Serviço","1.5.1.1.3.","AGETOP",51055,"LANÇAMENTO/APLICAÇÃO/ADENSAMENTO MANUAL DE CONCRETO - (O.C.)","m3    ",0.77,null,null,null,""]
["S",4,"S",0,1,5,1,1,0,0,0,"F","Serviço","Serviço","1.5.1.1.4.","AGETOP",60305,"ACO CA-50A - 10,0 MM (3/8\") - (OBRAS CIVIS)","Kg    ",61.45,null,null,null,""]
["S",4,"S",0,1,5,1,1,0,0,0,"F","Serviço","Serviço","1.5.1.1.5.","AGETOP",60314,"ACO CA - 60 - 5,0 MM - (OBRAS CIVIS)","Kg    ",22.09,null,null,null,""]
[4,4,4,6,1,5,1,2,0,6,19,"F","Nível 4","Nível 4","1.5.1.2.","SINAPI",null,"VIGAS TOPO","-",null,null,null,null,""]
["S",4,"S",0,1,5,1,2,0,0,0,"F","Serviço","Serviço","1.5.1.2.1.","AGETOP",60209,"FORMA CH.COMPENSADA 12MM-VIGA/PILAR U=4V - (OBRAS CIVIS","m2    ",12.26,null,null,null,""]
["S",4,"S",0,1,5,1,2,0,0,0,"F","Serviço","Serviço","1.5.1.2.2.","AGETOP",51030,"PREPARO COM BETONEIRA E TRANSPORTE MANUAL DE CONCRETO FCK=25 MPA","m3    ",0.74,null,null,null,""]
["S",4,"S",0,1,5,1,2,0,0,0,"F","Serviço","Serviço","1.5.1.2.3.","AGETOP",51055,"LANÇAMENTO/APLICAÇÃO/ADENSAMENTO MANUAL DE CONCRETO - (O.C.)","m3    ",0.74,null,null,null,""]
["S",4,"S",0,1,5,1,2,0,0,0,"F","Serviço","Serviço","1.5.1.2.4.","AGETOP",60304,"ACO CA-50 A - 8,0 MM (5/16\") - (OBRAS CIVIS)","Kg    ",26.36,null,null,null,""]
["S",4,"S",0,1,5,1,2,0,0,0,"F","Serviço","Serviço","1.5.1.2.5.","AGETOP",60314,"ACO CA - 60 - 5,0 MM - (OBRAS CIVIS)","Kg    ",12.45,null,null,null,""]
[3,3,3,17,1,5,2,0,0,30,17,"F","Nível 3","Nível 3","1.5.2.","SINAPI",null,"COZINHA","-",null,null,null,null,""]
[4,4,4,6,1,5,2,1,0,16,6,"F","Nível 4","Nível 4","1.5.2.1.","SINAPI",null,"PILARES","-",null,null,null,null,""]
["S",4,"S",0,1,5,2,1,0,0,0,"F","Serviço","Serviço","1.5.2.1.1.","AGETOP",60209,"FORMA CH.COMPENSADA 12MM-VIGA/PILAR U=4V - (OBRAS CIVIS","m2    ",39.6,null,null,null,""]
["S",4,"S",0,1,5,2,1,0,0,0,"F","Serviço","Serviço","1.5.2.1.2.","AGETOP",51030,"PREPARO COM BETONEIRA E TRANSPORTE MANUAL DE CONCRETO FCK=25 MPA","m3    ",1.95,null,null,null,""]
["S",4,"S",0,1,5,2,1,0,0,0,"F","Serviço","Serviço","1.5.2.1.3.","AGETOP",51055,"LANÇAMENTO/APLICAÇÃO/ADENSAMENTO MANUAL DE CONCRETO - (O.C.)","m3    ",1.95,null,null,null,""]
["S",4,"S",0,1,5,2,1,0,0,0,"F","Serviço","Serviço","1.5.2.1.4.","AGETOP",60305,"ACO CA-50A - 10,0 MM (3/8\") - (OBRAS CIVIS)","Kg    ",132.9,null,null,null,""]
["S",4,"S",0,1,5,2,1,0,0,0,"F","Serviço","Serviço","1.5.2.1.5.","AGETOP",60314,"ACO CA - 60 - 5,0 MM - (OBRAS CIVIS)","Kg    ",48.72,null,null,null,""]
[4,4,4,6,1,5,2,2,0,10,6,"F","Nível 4","Nível 4","1.5.2.2.","SINAPI",null,"VIGAS DE COBERTURA","-",null,null,null,null,""]
["S",4,"S",0,1,5,2,2,0,0,0,"F","Serviço","Serviço","1.5.2.2.1.","AGETOP",60209,"FORMA CH.COMPENSADA 12MM-VIGA/PILAR U=4V - (OBRAS CIVIS","m2    ",16.21,null,null,null,""]
["S",4,"S",0,1,5,2,2,0,0,0,"F","Serviço","Serviço","1.5.2.2.2.","AGETOP",51030,"PREPARO COM BETONEIRA E TRANSPORTE MANUAL DE CONCRETO FCK=25 MPA","m3    ",0.94,null,null,null,""]
["S",4,"S",0,1,5,2,2,0,0,0,"F","Serviço","Serviço","1.5.2.2.3.","AGETOP",51055,"LANÇAMENTO/APLICAÇÃO/ADENSAMENTO MANUAL DE CONCRETO - (O.C.)","m3    ",0.94,null,null,null,""]
["S",4,"S",0,1,5,2,2,0,0,0,"F","Serviço","Serviço","1.5.2.2.4.","AGETOP",60304,"ACO CA-50 A - 8,0 MM (5/16\") - (OBRAS CIVIS)","Kg    ",40.72,null,null,null,""]
["S",4,"S",0,1,5,2,2,0,0,0,"F","Serviço","Serviço","1.5.2.2.5.","AGETOP",60314,"ACO CA - 60 - 5,0 MM - (OBRAS CIVIS)","Kg    ",19.18,null,null,null,""]
[4,4,4,4,1,5,2,3,0,4,71,"F","Nível 4","Nível 4","1.5.2.3.","SINAPI",null,"CANALETA","-",null,null,null,null,""]
["S",4,"S",0,1,5,2,3,0,0,0,"F","Serviço","Serviço","1.5.2.3.1.","AGETOP",51030,"PREPARO COM BETONEIRA E TRANSPORTE MANUAL DE CONCRETO FCK=25 MPA","m3    ",0.49,null,null,null,""]
["S",4,"S",0,1,5,2,3,0,0,0,"F","Serviço","Serviço","1.5.2.3.2.","AGETOP",51055,"LANÇAMENTO/APLICAÇÃO/ADENSAMENTO MANUAL DE CONCRETO - (O.C.)","m3    ",0.49,null,null,null,""]
["S",4,"S",0,1,5,2,3,0,0,0,"F","Serviço","Serviço","1.5.2.3.3.","AGETOP",60304,"ACO CA-50 A - 8,0 MM (5/16\") - (OBRAS CIVIS)","Kg    ",16.53,null,null,null,""]
[3,3,3,13,1,5,3,0,0,13,122,"F","Nível 3","Nível 3","1.5.3.","SINAPI",null,"BANHEIRO","-",null,null,null,null,""]
[4,4,4,6,1,5,3,1,0,12,6,"F","Nível 4","Nível 4","1.5.3.1.","SINAPI",null,"PILARES","-",null,null,null,null,""]
["S",4,"S",0,1,5,3,1,0,0,0,"F","Serviço","Serviço","1.5.3.1.1.","AGETOP",60209,"FORMA CH.COMPENSADA 12MM-VIGA/PILAR U=4V - (OBRAS CIVIS","m2    ",20.72,null,null,null,""]
["S",4,"S",0,1,5,3,1,0,0,0,"F","Serviço","Serviço","1.5.3.1.2.","AGETOP",51030,"PREPARO COM BETONEIRA E TRANSPORTE MANUAL DE CONCRETO FCK=25 MPA","m3    ",0.99,null,null,null,""]
["S",4,"S",0,1,5,3,1,0,0,0,"F","Serviço","Serviço","1.5.3.1.3.","AGETOP",51055,"LANÇAMENTO/APLICAÇÃO/ADENSAMENTO MANUAL DE CONCRETO - (O.C.)","m3    ",0.99,null,null,null,""]
["S",4,"S",0,1,5,3,1,0,0,0,"F","Serviço","Serviço","1.5.3.1.4.","AGETOP",60305,"ACO CA-50A - 10,0 MM (3/8\") - (OBRAS CIVIS)","Kg    ",82.63636363636364,null,null,null,""]
["S",4,"S",0,1,5,3,1,0,0,0,"F","Serviço","Serviço","1.5.3.1.5.","AGETOP",60314,"ACO CA - 60 - 5,0 MM - (OBRAS CIVIS)","Kg    ",26.727272727272723,null,null,null,""]
[4,4,4,6,1,5,3,2,0,6,55,"F","Nível 4","Nível 4","1.5.3.2.","SINAPI",null,"VIGAS DE COBERTURA","-",null,null,null,null,""]
["S",4,"S",0,1,5,3,2,0,0,0,"F","Serviço","Serviço","1.5.3.2.1.","AGETOP",60209,"FORMA CH.COMPENSADA 12MM-VIGA/PILAR U=4V - (OBRAS CIVIS","m2    ",8.16,null,null,null,""]
["S",4,"S",0,1,5,3,2,0,0,0,"F","Serviço","Serviço","1.5.3.2.2.","AGETOP",51030,"PREPARO COM BETONEIRA E TRANSPORTE MANUAL DE CONCRETO FCK=25 MPA","m3    ",0.47,null,null,null,""]
["S",4,"S",0,1,5,3,2,0,0,0,"F","Serviço","Serviço","1.5.3.2.3.","AGETOP",51055,"LANÇAMENTO/APLICAÇÃO/ADENSAMENTO MANUAL DE CONCRETO - (O.C.)","m3    ",0.47,null,null,null,""]
["S",4,"S",0,1,5,3,2,0,0,0,"F","Serviço","Serviço","1.5.3.2.4.","AGETOP",60304,"ACO CA-50 A - 8,0 MM (5/16\") - (OBRAS CIVIS)","Kg    ",20.272727272727273,null,null,null,""]
["S",4,"S",0,1,5,3,2,0,0,0,"F","Serviço","Serviço","1.5.3.2.5.","AGETOP",60314,"ACO CA - 60 - 5,0 MM - (OBRAS CIVIS)","Kg    ",9.9090909090909083,null,null,null,""]
[2,2,2,30,1,6,0,0,0,412,30,"F","Nível 2","Nível 2","1.6.",null,null,"INSTALAÇÕES ELÉTRICAS","-",null,null,null,null,""]
[3,3,3,16,1,6,1,0,0,29,16,"F","Nível 3","Nível 3","1.6.1.","SINAPI",null,"IMPLANTAÇÃO","-",null,null,null,null,""]
["S",3,"S",0,1,6,1,0,0,0,0,"F","Serviço","Serviço","1.6.1.0.1.","SINAPI","74131/4","QUADRO DE DISTRIBUICAO DE ENERGIA DE EMBUTIR, EM CHAPA METALICA, PARA 18 DISJUNTORES TERMOMAGNETICOS MONOPOLARES, COM BARRAMENTO TRIFASICO E NEUTRO, FORNECIMENTO E INSTALACAO","UN",1,null,null,null,""]
["S",3,"S",0,1,6,1,0,0,0,0,"F","Serviço","Serviço","1.6.1.0.2.","AGETOP",71177,"DISJUNTOR TRIPOLAR DE 150 A 175-A","Un    ",2,null,null,null,""]
["S",3,"S",0,1,6,1,0,0,0,0,"F","Serviço","Serviço","1.6.1.0.3.","SINAPI",93671,"DISJUNTOR TRIPOLAR TIPO DIN, CORRENTE NOMINAL DE 32A - FORNECIMENTO E INSTALAÇÃO. AF_04/2016","UN",3,null,null,null,"Referência: AGETOP - 71173"]
["S",3,"S",0,1,6,1,0,0,0,0,"F","Serviço","Serviço","1.6.1.0.4.","AGETOP",71184,"DISPOSITIVO DE PROTEÇÃO CONTRA SURTOS (D.P.S.) 275V DE 8 A 40KA","Un    ",3,null,null,null,""]
["S",3,"S",0,1,6,1,0,0,{"$f":"IF(OR($C211=\"S\",$C211=0),0,MATCH(0,OFFSET($D211,1,$C211,ROW($C$928)-ROW($C211)),0))","v":0},{"$f":"IF(OR($C211=\"S\",$C211=0),0,MATCH(OFFSET($D211,0,$C211)+1,OFFSET($D211,1,$C211,ROW($C$928)-ROW($C211)),0))","v":0},"F","Serviço","Serviço","1.6.1.0.5.","SINAPI",91928,"CABO DE COBRE FLEXÍVEL ISOLADO, 4 MM², ANTI-CHAMA 450/750 V, PARA CIRCUITOS TERMINAIS - FORNECIMENTO E INSTALAÇÃO. AF_12/2015","M",838,null,null,null,"Referência: AGETOP - 70564"]
["S",3,"S",0,1,6,1,0,0,0,0,"F","Serviço","Serviço","1.6.1.0.6.","AGETOP",70541,"CABO DE COBRE NU No. 16 MM2 (6,94 M/KG)","M     ",30,null,null,null,""]
["S",3,"S",0,1,6,1,0,0,0,0,"F","Serviço","Serviço","1.6.1.0.7.","SINAPI",91868,"ELETRODUTO RÍGIDO ROSCÁVEL, PVC, DN 32 MM (1\"), PARA CIRCUITOS TERMINAIS, INSTALADO EM LAJE - FORNECIMENTO E INSTALAÇÃO. AF_12/2015","M",168,null,null,null,"Referência: AGETOP - 71202"]
["S",3,"S",0,1,6,1,0,0,0,0,"F","Serviço","Serviço","1.6.1.0.8.","AGETOP",70352,"BRACADEIRA METALICA TIPO \"U\" DIAM. 1\"","Un    ",56,null,null,null,""]
["S",3,"S",0,1,6,1,0,0,0,0,"F","Serviço","Serviço","1.6.1.0.9.","SINAPI",91880,"LUVA PARA ELETRODUTO, PVC, ROSCÁVEL, DN 32 MM (1\"), PARA CIRCUITOS TERMINAIS, INSTALADA EM LAJE - FORNECIMENTO E INSTALAÇÃO. AF_12/2015","UN",56,null,null,null,"Referência: AGETOP - 71742"]
["S",{"$f":"IF(OR(C216=\"s\",C216=0),OFFSET(B216,-1,0),C216)","v":3},{"$f":"IF(OFFSET(C216,-1,0)=\"L\",1,IF(OFFSET(C216,-1,0)=1,2,IF(OR(A216=\"s\",A216=0),\"S\",IF(AND(OFFSET(C216,-1,0)=2,A216=4),3,IF(AND(OR(OFFSET(C216,-1,0)=\"s\",OFFSET(C216,-1,0)=0),A216<>\"s\",A216>OFFSET(B216,-1,0)),OFFSET(B216,-1,0),A216)))))","v":"S"},{"$f":"IF(OR(C216=\"S\",C216=0),0,IF(ISERROR(K216),J216,SMALL(J216:K216,1)))","v":0},{"$f":"IF($C216=1,OFFSET(E216,-1,0)+1,OFFSET(E216,-1,0))","v":1},{"$f":"IF($C216=1,0,IF($C216=2,OFFSET(F216,-1,0)+1,OFFSET(F216,-1,0)))","v":6},{"$f":"IF(AND($C216<=2,$C216<>0),0,IF($C216=3,OFFSET(G216,-1,0)+1,OFFSET(G216,-1,0)))","v":1},{"$f":"IF(AND($C216<=3,$C216<>0),0,IF($C216=4,OFFSET(H216,-1,0)+1,OFFSET(H216,-1,0)))","v":0},{"$f":"IF(AND($C216<=4,$C216<>0),0,IF(AND($C216=\"S\",$W216>0),OFFSET(I216,-1,0)+1,OFFSET(I216,-1,0)))","v":0},0,0,"F","Serviço","Serviço","1.6.1.0.10.","SINAPI",97891,"CAIXA ENTERRADA ELÉTRICA RETANGULAR, EM ALVENARIA COM BLOCOS DE CONCRETO, FUNDO COM BRITA, DIMENSÕES INTERNAS: 0,4X0,4X0,4 M. AF_05/2018","UN",3,null,null,null,""]
["S",3,"S",0,1,6,1,0,0,0,0,"F","Serviço","Serviço","1.6.1.0.11.","SINAPI",6171,"TAMPA DE CONCRETO ARMADO 60X60X5CM PARA CAIXA","UN",3,null,null,null,""]
["S",3,"S",0,1,6,1,0,0,0,0,"F","Serviço","Serviço","1.6.1.0.12.","AGETOP",71861,"PARAFUSO P/BUCHA S-6","Un    ",448,null,null,null,""]
["S",3,"S",0,1,6,1,0,0,0,0,"F","Serviço","Serviço","1.6.1.0.13.","AGETOP",70391,"BUCHA DE NYLON S-6","Un    ",448,null,null,null,""]
["S",3,"S",0,1,6,1,0,0,0,0,"F","Serviço","Serviço","1.6.1.0.14.","AGETOP",71380,"HASTE REV.COBRE(COPPERWELD)  3/4\" X 2,40 M C/CONECTOR","Un    ",3,null,null,null,""]
["S",3,"S",0,1,6,1,0,0,0,0,"F","Serviço","Serviço","1.6.1.0.15.","AGETOP",70255,"ATERRAMENTO - SOLDA EXOTÉRMICA - CARTUCHO 90 G","un    ",3,null,null,null,""]
[3,3,3,13,1,6,2,0,0,13,62,"F","Nível 3","Nível 3","1.6.2.",null,null,"REFORMA ELÉTRICA","-",null,null,null,null,""]
["S",3,"S",0,1,6,2,0,0,0,0,"F","Serviço","Serviço","1.6.2.0.1.","SINAPI",97593,"LUMINÁRIA TIPO SPOT, DE SOBREPOR, COM 1 LÂMPADA DE 15 W - FORNECIMENTO E INSTALAÇÃO. AF_11/2017","UN",5,null,null,null,"Referência: AGETOP - 71688"]
["S",3,"S",0,1,6,2,0,0,0,0,"F","Serviço","Serviço","1.6.2.0.2.","SINAPI",97610,"LÂMPADA COMPACTA DE LED 10 W, BASE E27 - FORNECIMENTO E INSTALAÇÃO. AF_11/2017","UN",5,null,null,null,""]
["S",3,"S",0,1,6,2,0,0,0,0,"F","Serviço","Serviço","1.6.2.0.3.","SINAPI",97601,"REFLETOR EM ALUMÍNIO COM SUPORTE E ALÇA, LÂMPADA 250 W - FORNECIMENTO E INSTALAÇÃO. AF_11/2017","UN",4,null,null,null,""]
["S",3,"S",0,1,6,2,0,0,0,0,"F","Serviço","Serviço","1.6.2.0.4.","SINAPI","73831/2","LAMPADA DE VAPOR DE MERCURIO DE 250W - FORNECIMENTO E INSTALACAO","UN",4,null,null,null,""]
["S",3,"S",0,1,6,2,0,0,0,0,"F","Serviço","Serviço","1.6.2.0.5.","SINAPI",91926,"CABO DE COBRE FLEXÍVEL ISOLADO, 2,5 MM², ANTI-CHAMA 450/750 V, PARA CIRCUITOS TERMINAIS - FORNECIMENTO E INSTALAÇÃO. AF_12/2015","M",230,null,null,null,"Referência: AGETOP - 70563"]
["S",3,"S",0,1,6,2,0,0,0,0,"F","Serviço","Serviço","1.6.2.0.6.","SINAPI",91928,"CABO DE COBRE FLEXÍVEL ISOLADO, 4 MM², ANTI-CHAMA 450/750 V, PARA CIRCUITOS TERMINAIS - FORNECIMENTO E INSTALAÇÃO. AF_12/2015","M",220,null,null,null,"Referência: AGETOP - 70564"]
["S",3,"S",0,1,6,2,0,0,0,0,"F","Serviço","Serviço","1.6.2.0.7.","SINAPI",91864,"ELETRODUTO RÍGIDO ROSCÁVEL, PVC, DN 32 MM (1\"), PARA CIRCUITOS TERMINAIS, INSTALADO EM FORRO - FORNECIMENTO E INSTALAÇÃO. AF_12/2015","M",58,null,null,null,""]
[{"$f":"CHOOSE(1+LOG(1+2*(ORÇAMENTO.Nivel=\"Nível 1\")+4*(ORÇAMENTO.Nivel=\"Nível 2\")+8*(ORÇAMENTO.Nivel=\"Nível 3\")+16*(ORÇAMENTO.Nivel=\"Nível 4\")+32*(ORÇAMENTO.Nivel=\"Serviço\"),2),0,1,2,3,4,\"S\")","v":"S"},3,"S",0,1,6,2,0,0,0,0,"F","Serviço","Serviço","1.6.2.0.8.","AGETOP",70422,"BUCHA E ARRUELA METALICA DIAM. 1\"","PR    ",15,null,null,null,""]
["S",3,"S",0,1,6,2,0,0,0,0,"F","Serviço","Serviço","1.6.2.0.9.","SINAPI",91876,"LUVA PARA ELETRODUTO, PVC, ROSCÁVEL, DN 32 MM (1\"), PARA CIRCUITOS TERMINAIS, INSTALADA EM FORRO - FORNECIMENTO E INSTALAÇÃO. AF_12/2015","UN",15,null,null,null,""]
["S",3,"S",0,1,6,2,0,0,0,0,"F","Serviço","Serviço","1.6.2.0.10.","SINAPI",92870,"CAIXA RETANGULAR 4\" X 4\" ALTA (2,00 M DO PISO), METÁLICA, INSTALADA EM PAREDE - FORNECIMENTO E INSTALAÇÃO. AF_12/2015","UN",5,null,null,null,""]
["S",3,"S",0,1,6,2,0,0,0,0,"F","Serviço","Serviço","1.6.2.0.11.","AGETOP",71861,"PARAFUSO P/BUCHA S-6","Un    ",100,null,null,null,""]
["S",3,"S",0,1,6,2,0,0,0,0,"F","Serviço","Serviço","1.6.2.0.12.","AGETOP",70391,"BUCHA DE NYLON S-6","Un    ",100,null,null,null,""]
[2,2,2,133,1,7,0,0,0,382,133,"F","Nível 2","Nível 2","1.7.","AGETOP",null,"INSTALAÇÕES HIDROSSANITÁRIAS","-",null,null,null,null,""]
[3,3,3,41,1,7,1,0,0,132,41,"F","Nível 3","Nível 3","1.7.1.","SINAPI",null,"PEÇAS E ACESSÓRIOS - REFORMA HIDRÁULICA","-",null,null,null,null,""]
[4,4,4,8,1,7,1,1,0,40,8,"F","Nível 4","Nível 4","1.7.1.1.","SINAPI",null,"VASO SANITÁRIO E ACESSÓRIOS","-",null,null,null,null,""]
["S",4,"S",0,1,7,1,1,0,0,0,"F","Serviço","Serviço","1.7.1.1.1.","SINAPI",95470,"VASO SANITARIO SIFONADO CONVENCIONAL COM LOUÇA BRANCA, INCLUSO CONJUNTO DE LIGAÇÃO PARA BACIA SANITÁRIA AJUSTÁVEL - FORNECIMENTO E INSTALAÇÃO. AF_10/2016","UN",19,null,null,null,""]
["S",4,"S",0,1,7,1,1,0,0,0,"F","Serviço","Serviço","1.7.1.1.2.","SINAPI",99635,"VÁLVULA DE DESCARGA METÁLICA, BASE 1 1/2 \", ACABAMENTO METALICO CROMADO - FORNECIMENTO E INSTALAÇÃO. AF_01/2019","UN",7,null,null,null,"Referência: AGETOP - 80515"]
[{"$f":"CHOOSE(1+LOG(1+2*(ORÇAMENTO.Nivel=\"Nível 1\")+4*(ORÇAMENTO.Nivel=\"Nível 2\")+8*(ORÇAMENTO.Nivel=\"Nível 3\")+16*(ORÇAMENTO.Nivel=\"Nível 4\")+32*(ORÇAMENTO.Nivel=\"Serviço\"),2),0,1,2,3,4,\"S\")","v":"S"},{"$f":"IF(OR(C240=\"s\",C240=0),OFFSET(B240,-1,0),C240)","v":4},{"$f":"IF(OFFSET(C240,-1,0)=\"L\",1,IF(OFFSET(C240,-1,0)=1,2,IF(OR(A240=\"s\",A240=0),\"S\",IF(AND(OFFSET(C240,-1,0)=2,A240=4),3,IF(AND(OR(OFFSET(C240,-1,0)=\"s\",OFFSET(C240,-1,0)=0),A240<>\"s\",A240>OFFSET(B240,-1,0)),OFFSET(B240,-1,0),A240)))))","v":"S"},{"$f":"IF(OR(C240=\"S\",C240=0),0,IF(ISERROR(K240),J240,SMALL(J240:K240,1)))","v":0},{"$f":"IF($C240=1,OFFSET(E240,-1,0)+1,OFFSET(E240,-1,0))","v":1},{"$f":"IF($C240=1,0,IF($C240=2,OFFSET(F240,-1,0)+1,OFFSET(F240,-1,0)))","v":7},{"$f":"IF(AND($C240<=2,$C240<>0),0,IF($C240=3,OFFSET(G240,-1,0)+1,OFFSET(G240,-1,0)))","v":1},{"$f":"IF(AND($C240<=3,$C240<>0),0,IF($C240=4,OFFSET(H240,-1,0)+1,OFFSET(H240,-1,0)))","v":1},{"$f":"IF(AND($C240<=4,$C240<>0),0,IF(AND($C240=\"S\",$W240>0),OFFSET(I240,-1,0)+1,OFFSET(I240,-1,0)))","v":0},0,0,"F","Serviço","Serviço","1.7.1.1.3.","AGETOP",80514,"TUBO DE LIGACAO PVC CROMADO 1.1/2\" / ESPUDE  - (ENTRADA)","Un    ",7,null,null,null,""]
["S",4,"S",0,1,7,1,1,0,0,0,"F","Serviço","Serviço","1.7.1.1.4.","AGETOP",80520,"CONJUNTO DE FIXACAO P/VASO SANITARIO (PAR)","CJ    ",19,null,null,null,""]
["S",4,"S",0,1,7,1,1,0,0,0,"F","Serviço","Serviço","1.7.1.1.5.","AGETOP",80526,"ASSENTO EM POLIPROPILENO COM SISTEMA DE FECHAMENTO SUAVE PARA VASO SANITÁRIO","Un    ",19,null,null,null,""]
["S",4,"S",0,1,7,1,1,0,0,0,"F","Serviço","Serviço","1.7.1.1.6.","AGETOP",80510,"ANEL DE VEDAÇÃO PARA VASO SANITÁRIO","Un    ",19,null,null,null,""]
["S",4,"S",0,1,7,1,1,0,0,0,"F","Serviço","Serviço","1.7.1.1.7.","SINAPI",95544,"PAPELEIRA DE PAREDE EM METAL CROMADO SEM TAMPA, INCLUSO FIXAÇÃO. AF_10/2016","UN",19,null,null,null,""]
[4,4,4,9,1,7,1,2,0,32,9,"F","Nível 4","Nível 4","1.7.1.2.","SINAPI",null,"LAVATÓRIO E ACESSÓRIOS","-",null,null,null,null,""]
["S",4,"S",0,1,7,1,2,0,0,0,"F","Serviço","Serviço","1.7.1.2.1.","AGETOP",80556,"LIGAÇÃO FLEXÍVEL PVC DIAM.1/2\" (ENGATE)","Un    ",14,null,null,null,""]
["S",4,"S",0,1,7,1,2,0,0,0,"F","Serviço","Serviço","1.7.1.2.2.","SINAPI",86883,"SIFÃO DO TIPO FLEXÍVEL EM PVC 1\u0094 X 1.1/2\u0094 - FORNECIMENTO E INSTALAÇÃO. AF_12/2013","UN",14,null,null,null,""]
["S",4,"S",0,1,7,1,2,0,0,0,"F","Serviço","Serviço","1.7.1.2.3.","SINAPI",86915,"TORNEIRA CROMADA DE MESA, 1/2\" OU 3/4\", PARA LAVATÓRIO, PADRÃO MÉDIO - FORNECIMENTO E INSTALAÇÃO. AF_12/2013","UN",14,null,null,null,"Referência: AGETOP - 80570"]
["S",4,"S",0,1,7,1,2,0,0,0,"F","Serviço","Serviço","1.7.1.2.4.","SINAPI",86877,"VÁLVULA EM METAL CROMADO 1.1/2\" X 1.1/2\" PARA TANQUE OU LAVATÓRIO, COM OU SEM LADRÃO - FORNECIMENTO E INSTALAÇÃO. AF_12/2013","UN",14,null,null,null,""]
["S",4,"S",0,1,7,1,2,0,0,0,"F","Serviço","Serviço","1.7.1.2.5.","SINAPI",86901,"CUBA DE EMBUTIR OVAL EM LOUÇA BRANCA, 35 X 50CM OU EQUIVALENTE - FORNECIMENTO E INSTALAÇÃO. AF_12/2013","UN",12,null,null,null,"Referência: AGETOP - 80587"]
["S",4,"S",0,1,7,1,2,0,0,0,"F","Serviço","Serviço","1.7.1.2.6.","SINAPI","74234/1","MICTORIO SIFONADO DE LOUCA BRANCA COM PERTENCES, COM REGISTRO DE PRESSAO 1/2\" COM CANOPLA CROMADA ACABAMENTO SIMPLES E CONJUNTO PARA FIXACAO  - FORNECIMENTO E INSTALACAO","UN",6,null,null,null,"Referência: AGETOP - 80601"]
["S",4,"S",0,1,7,1,2,0,0,0,"F","Serviço","Serviço","1.7.1.2.7.","AGETOP",80610,"KIT FERR.P/MICT.LOUCA (ESPUDE,CONEXÃO ENTR.PARAFUSOS)","Un    ",6,null,null,null,""]
["S",4,"S",0,1,7,1,2,0,0,0,"F","Serviço","Serviço","1.7.1.2.8.","AGETOP",80613,"SIFÃO METÁLICO 1 1/2\" X 2\" P/MICTÓRIO","Un    ",6,null,null,null,""]
[4,4,4,5,1,7,1,3,0,23,5,"F","Nível 4","Nível 4","1.7.1.3.","SINAPI",null,"PIA E ACESSÓRIOS","-",null,null,null,null,""]
[{"$f":"CHOOSE(1+LOG(1+2*(ORÇAMENTO.Nivel=\"Nível 1\")+4*(ORÇAMENTO.Nivel=\"Nível 2\")+8*(ORÇAMENTO.Nivel=\"Nível 3\")+16*(ORÇAMENTO.Nivel=\"Nível 4\")+32*(ORÇAMENTO.Nivel=\"Serviço\"),2),0,1,2,3,4,\"S\")","v":"S"},{"$f":"IF(OR(C255=\"s\",C255=0),OFFSET(B255,-1,0),C255)","v":4},{"$f":"IF(OFFSET(C255,-1,0)=\"L\",1,IF(OFFSET(C255,-1,0)=1,2,IF(OR(A255=\"s\",A255=0),\"S\",IF(AND(OFFSET(C255,-1,0)=2,A255=4),3,IF(AND(OR(OFFSET(C255,-1,0)=\"s\",OFFSET(C255,-1,0)=0),A255<>\"s\",A255>OFFSET(B255,-1,0)),OFFSET(B255,-1,0),A255)))))","v":"S"},{"$f":"IF(OR(C255=\"S\",C255=0),0,IF(ISERROR(K255),J255,SMALL(J255:K255,1)))","v":0},{"$f":"IF($C255=1,OFFSET(E255,-1,0)+1,OFFSET(E255,-1,0))","v":1},{"$f":"IF($C255=1,0,IF($C255=2,OFFSET(F255,-1,0)+1,OFFSET(F255,-1,0)))","v":7},{"$f":"IF(AND($C255<=2,$C255<>0),0,IF($C255=3,OFFSET(G255,-1,0)+1,OFFSET(G255,-1,0)))","v":1},{"$f":"IF(AND($C255<=3,$C255<>0),0,IF($C255=4,OFFSET(H255,-1,0)+1,OFFSET(H255,-1,0)))","v":3},{"$f":"IF(AND($C255<=4,$C255<>0),0,IF(AND($C255=\"S\",$W255>0),OFFSET(I255,-1,0)+1,OFFSET(I255,-1,0)))","v":0},0,0,"F","Serviço","Serviço","1.7.1.3.1.","AGETOP",80689,"CUBA INOX 50X40X20CM E=0,7MM-AÇO 304","Un    ",4,null,null,null,""]
["S",4,"S",0,1,7,1,3,0,0,0,"F","Serviço","Serviço","1.7.1.3.2.","SINAPI",86912,"TORNEIRA CROMADA LONGA, DE PAREDE, 1/2\" OU 3/4\", PARA PIA DE COZINHA, PADRÃO MÉDIO - FORNECIMENTO E INSTALAÇÃO. AF_12/2013","UN",4,null,null,null,""]
["S",4,"S",0,1,7,1,3,0,0,0,"F","Serviço","Serviço","1.7.1.3.3.","SINAPI",86881,"SIFÃO DO TIPO GARRAFA EM METAL CROMADO 1 X 1.1/2\" - FORNECIMENTO E INSTALAÇÃO. AF_12/2013","UN",4,null,null,null,"Referência: AGETOP - 80670"]
["S",4,"S",0,1,7,1,3,0,0,0,"F","Serviço","Serviço","1.7.1.3.4.","SINAPI",86878,"VÁLVULA EM METAL CROMADO TIPO AMERICANA 3.1/2\" X 1.1/2\" PARA PIA - FORNECIMENTO E INSTALAÇÃO. AF_12/2013","UN",4,null,null,null,""]
[4,4,4,5,1,7,1,4,0,18,5,"F","Nível 4","Nível 4","1.7.1.4.","SINAPI",null,"FILTRO E CHUVEIROS","-",null,null,null,null,""]
[{"$f":"CHOOSE(1+LOG(1+2*(ORÇAMENTO.Nivel=\"Nível 1\")+4*(ORÇAMENTO.Nivel=\"Nível 2\")+8*(ORÇAMENTO.Nivel=\"Nível 3\")+16*(ORÇAMENTO.Nivel=\"Nível 4\")+32*(ORÇAMENTO.Nivel=\"Serviço\"),2),0,1,2,3,4,\"S\")","v":"S"},{"$f":"IF(OR(C260=\"s\",C260=0),OFFSET(B260,-1,0),C260)","v":4},{"$f":"IF(OFFSET(C260,-1,0)=\"L\",1,IF(OFFSET(C260,-1,0)=1,2,IF(OR(A260=\"s\",A260=0),\"S\",IF(AND(OFFSET(C260,-1,0)=2,A260=4),3,IF(AND(OR(OFFSET(C260,-1,0)=\"s\",OFFSET(C260,-1,0)=0),A260<>\"s\",A260>OFFSET(B260,-1,0)),OFFSET(B260,-1,0),A260)))))","v":"S"},{"$f":"IF(OR(C260=\"S\",C260=0),0,IF(ISERROR(K260),J260,SMALL(J260:K260,1)))","v":0},{"$f":"IF($C260=1,OFFSET(E260,-1,0)+1,OFFSET(E260,-1,0))","v":1},{"$f":"IF($C260=1,0,IF($C260=2,OFFSET(F260,-1,0)+1,OFFSET(F260,-1,0)))","v":7},{"$f":"IF(AND($C260<=2,$C260<>0),0,IF($C260=3,OFFSET(G260,-1,0)+1,OFFSET(G260,-1,0)))","v":1},{"$f":"IF(AND($C260<=3,$C260<>0),0,IF($C260=4,OFFSET(H260,-1,0)+1,OFFSET(H260,-1,0)))","v":4},{"$f":"IF(AND($C260<=4,$C260<>0),0,IF(AND($C260=\"S\",$W260>0),OFFSET(I260,-1,0)+1,OFFSET(I260,-1,0)))","v":0},0,0,"F","Serviço","Serviço","1.7.1.4.1.","SINAPI",9535,"CHUVEIRO ELETRICO COMUM CORPO PLASTICO TIPO DUCHA, FORNECIMENTO E INSTALACAO","UN",6,null,null,null,""]
["S",4,"S",0,1,7,1,4,0,0,0,"F","Serviço","Serviço","1.7.1.4.2.","SINAPI",9535,"CHUVEIRO ELETRICO COMUM CORPO PLASTICO TIPO DUCHA, FORNECIMENTO E INSTALACAO","UN",1,null,null,null,""]
["S",4,"S",0,1,7,1,4,0,0,0,"F","Serviço","Serviço","1.7.1.4.3.","SINAPI",95543,"PORTA TOALHA BANHO EM METAL CROMADO, TIPO BARRA, INCLUSO FIXAÇÃO. AF_10/2016","UN",1,null,null,null,""]
["S",4,"S",0,1,7,1,4,0,0,0,"F","Serviço","Serviço","1.7.1.4.4.","SINAPI",88571,"SABONETEIRA DE SOBREPOR (FIXADA NA PAREDE), TIPO CONCHA, EM ACO INOXIDAVEL - FORNECIMENTO E INSTALACAO","UN",7,null,null,null,"Referência: AGETOP - 80741"]
[4,4,4,7,1,7,1,5,0,13,7,"F","Nível 4","Nível 4","1.7.1.5.","SINAPI",null,"TANQUES / TORNEIRAS","-",null,null,null,null,""]
["S",4,"S",0,1,7,1,5,0,0,0,"F","Serviço","Serviço","1.7.1.5.1.","AGETOP",80802,"TANQUE MARMORE/GRANITO SINTÉTICO C/DUAS CUBAS E 1 BATEDOR","Un    ",1,null,null,null,""]
["S",4,"S",0,1,7,1,5,0,0,0,"F","Serviço","Serviço","1.7.1.5.2.","AGETOP",80562,"SIFAO FLEXIVEL UNIVERSAL ( SANFONADO) EM PVC PARA LAVATORIO","Un    ",4,null,null,null,""]
["S",4,"S",0,1,7,1,5,0,0,0,"F","Serviço","Serviço","1.7.1.5.3.","SINAPI",86877,"VÁLVULA EM METAL CROMADO 1.1/2\" X 1.1/2\" PARA TANQUE OU LAVATÓRIO, COM OU SEM LADRÃO - FORNECIMENTO E INSTALAÇÃO. AF_12/2013","UN",4,null,null,null,""]
["S",4,"S",0,1,7,1,5,0,0,0,"F","Serviço","Serviço","1.7.1.5.4.","AGETOP",80693,"TANQUE (PANELAO) INOX 60 X 70 X 40 CM CH.18","Un    ",2,null,null,null,""]
["S",4,"S",0,1,7,1,5,0,0,0,"F","Serviço","Serviço","1.7.1.5.5.","AGETOP",80840,"TAMPA T-5 ARTICULADA 20X20","Un    ",2,null,null,null,""]
["S",4,"S",0,1,7,1,5,0,0,0,"F","Serviço","Serviço","1.7.1.5.6.","AGETOP",80845,"CAIXA DE ALVENARIA 20x20x25 CM (REVESTIMENTO IMPERMEABILIZADO), FUNDO DE BRITA SEM TAMPA - PARA REGISTRO/TORNEIRA JARDIM","Un    ",1,null,null,null,""]
[4,4,4,6,1,7,1,6,0,6,34,"F","Nível 4","Nível 4","1.7.1.6.","SINAPI",null,"REGISTROS","-",null,null,null,null,""]
["S",4,"S",0,1,7,1,6,0,0,0,"F","Serviço","Serviço","1.7.1.6.1.","AGETOP",80905,"REGISTRO DE GAVETA BRUTO DIAMETRO 1.1/2\"","Un    ",1,null,null,null,""]
["S",4,"S",0,1,7,1,6,0,0,0,"F","Serviço","Serviço","1.7.1.6.2.","SINAPI",89987,"REGISTRO DE GAVETA BRUTO, LATÃO, ROSCÁVEL, 3/4\", COM ACABAMENTO E CANOPLA CROMADOS. FORNECIDO E INSTALADO EM RAMAL DE ÁGUA. AF_12/2014","UN",2,null,null,null,"Referência: AGETOP - 80926"]
["S",4,"S",0,1,7,1,6,0,0,0,"F","Serviço","Serviço","1.7.1.6.3.","SINAPI",94794,"REGISTRO DE GAVETA BRUTO, LATÃO, ROSCÁVEL, 1 1/2\u0094, COM ACABAMENTO E CANOPLA CROMADOS, INSTALADO EM RESERVAÇÃO DE ÁGUA DE EDIFICAÇÃO QUE POSSUA RESERVATÓRIO DE FIBRA/FIBROCIMENTO \u0096 FORNECIMENTO E INSTALAÇÃO. AF_06/2016","UN",3,null,null,null,"Referência: AGETOP - 80929"]
["S",4,"S",0,1,7,1,6,0,{"$f":"IF(OR($C275=\"S\",$C275=0),0,MATCH(0,OFFSET($D275,1,$C275,ROW($C$928)-ROW($C275)),0))","v":0},{"$f":"IF(OR($C275=\"S\",$C275=0),0,MATCH(OFFSET($D275,0,$C275)+1,OFFSET($D275,1,$C275,ROW($C$928)-ROW($C275)),0))","v":0},"F","Serviço","Serviço","1.7.1.6.4.","AGETOP",80910,"REGISTRO DE GAVETA BRUTO DIAMETRO 2.1/2\"","Un    ",1,null,null,null,""]
["S",4,"S",0,1,7,1,6,0,0,0,"F","Serviço","Serviço","1.7.1.6.5.","SINAPI",89984,"REGISTRO DE PRESSÃO BRUTO, LATÃO, ROSCÁVEL, 1/2\", COM ACABAMENTO E CANOPLA CROMADOS. FORNECIDO E INSTALADO EM RAMAL DE ÁGUA. AF_12/2014","UN",7,null,null,null,"Referência: AGETOP - 80925"]
[3,3,3,7,1,7,2,0,0,91,7,"F","Nível 3","Nível 3","1.7.2.","SINAPI",null,"PEÇAS E ACESSÓRIOS - LABORATÓRIO DE CIÊNCIAS","-",null,null,null,null,""]
["S",{"$f":"IF(OR(C278=\"s\",C278=0),OFFSET(B278,-1,0),C278)","v":3},{"$f":"IF(OFFSET(C278,-1,0)=\"L\",1,IF(OFFSET(C278,-1,0)=1,2,IF(OR(A278=\"s\",A278=0),\"S\",IF(AND(OFFSET(C278,-1,0)=2,A278=4),3,IF(AND(OR(OFFSET(C278,-1,0)=\"s\",OFFSET(C278,-1,0)=0),A278<>\"s\",A278>OFFSET(B278,-1,0)),OFFSET(B278,-1,0),A278)))))","v":"S"},{"$f":"IF(OR(C278=\"S\",C278=0),0,IF(ISERROR(K278),J278,SMALL(J278:K278,1)))","v":0},{"$f":"IF($C278=1,OFFSET(E278,-1,0)+1,OFFSET(E278,-1,0))","v":1},{"$f":"IF($C278=1,0,IF($C278=2,OFFSET(F278,-1,0)+1,OFFSET(F278,-1,0)))","v":7},{"$f":"IF(AND($C278<=2,$C278<>0),0,IF($C278=3,OFFSET(G278,-1,0)+1,OFFSET(G278,-1,0)))","v":2},{"$f":"IF(AND($C278<=3,$C278<>0),0,IF($C278=4,OFFSET(H278,-1,0)+1,OFFSET(H278,-1,0)))","v":0},{"$f":"IF(AND($C278<=4,$C278<>0),0,IF(AND($C278=\"S\",$W278>0),OFFSET(I278,-1,0)+1,OFFSET(I278,-1,0)))","v":0},0,0,"F","Serviço","Serviço","1.7.2.0.1.","COMPOSIÇÃO","COMP 554_SEE","CAIXA DE DECANTAÇÃO","UN ",1,null,null,null,""]
["S",3,"S",0,1,7,2,0,0,0,0,"F","Serviço","Serviço","1.7.2.0.2.","AGETOP",80556,"LIGAÇÃO FLEXÍVEL PVC DIAM.1/2\" (ENGATE)","Un    ",3,null,null,null,""]
["S",3,"S",0,1,7,2,0,0,0,0,"F","Serviço","Serviço","1.7.2.0.3.","SINAPI",86909,"TORNEIRA CROMADA TUBO MÓVEL, DE MESA, 1/2\" OU 3/4\", PARA PIA DE COZINHA, PADRÃO ALTO - FORNECIMENTO E INSTALAÇÃO. AF_12/2013","UN",3,null,null,null,""]
["S",3,"S",0,1,7,2,0,0,0,0,"F","Serviço","Serviço","1.7.2.0.4.","SINAPI",86881,"SIFÃO DO TIPO GARRAFA EM METAL CROMADO 1 X 1.1/2\" - FORNECIMENTO E INSTALAÇÃO. AF_12/2013","UN",3,null,null,null,"Referência: AGETOP - 80670"]
["S",3,"S",0,1,7,2,0,0,0,0,"F","Serviço","Serviço","1.7.2.0.5.","SINAPI",86878,"VÁLVULA EM METAL CROMADO TIPO AMERICANA 3.1/2\" X 1.1/2\" PARA PIA - FORNECIMENTO E INSTALAÇÃO. AF_12/2013","UN",3,null,null,null,""]
["S",3,"S",0,1,7,2,0,0,0,0,"F","Serviço","Serviço","1.7.2.0.6.","SINAPI",89987,"REGISTRO DE GAVETA BRUTO, LATÃO, ROSCÁVEL, 3/4\", COM ACABAMENTO E CANOPLA CROMADOS. FORNECIDO E INSTALADO EM RAMAL DE ÁGUA. AF_12/2014","UN",3,null,null,null,"Referência: AGETOP - 80926"]
[3,3,3,30,1,7,3,0,0,84,30,"F","Nível 3","Nível 3","1.7.3.","SINAPI",null,"ÁGUA FRIA - REFORMA HIDRÁULICA","-",null,null,null,null,""]
[4,4,4,4,1,7,3,1,0,29,4,"F","Nível 4","Nível 4","1.7.3.1.","SINAPI",null,"TUBOS DE PVC SOLDÁVEL","-",null,null,null,null,""]
["S",4,"S",0,1,7,3,1,0,0,0,"F","Serviço","Serviço","1.7.3.1.1.","SINAPI",89402,"TUBO, PVC, SOLDÁVEL, DN 25MM, INSTALADO EM RAMAL DE DISTRIBUIÇÃO DE ÁGUA - FORNECIMENTO E INSTALAÇÃO. AF_12/2014","M",84,null,null,null,"Referência: AGETOP - 81003"]
["S",4,"S",0,1,7,3,1,0,0,0,"F","Serviço","Serviço","1.7.3.1.2.","SINAPI",89449,"TUBO, PVC, SOLDÁVEL, DN 50MM, INSTALADO EM PRUMADA DE ÁGUA - FORNECIMENTO E INSTALAÇÃO. AF_12/2014","M",120,null,null,null,""]
["S",4,"S",0,1,7,3,1,0,0,0,"F","Serviço","Serviço","1.7.3.1.3.","SINAPI",89451,"TUBO, PVC, SOLDÁVEL, DN 75MM, INSTALADO EM PRUMADA DE ÁGUA - FORNECIMENTO E INSTALAÇÃO. AF_12/2014","M",252,null,null,null,""]
[4,4,4,5,1,7,3,2,0,25,5,"F","Nível 4","Nível 4","1.7.3.2.","SINAPI",null,"ADAPTADORES DE PVC SOLDÁVEL","-",null,null,null,null,""]
["S",4,"S",0,1,7,3,2,0,0,0,"F","Serviço","Serviço","1.7.3.2.1.","SINAPI",94789,"ADAPTADOR COM FLANGES LIVRES, PVC, SOLDÁVEL LONGO, DN 75 MM X 2 1/2 , INSTALADO EM RESERVAÇÃO DE ÁGUA DE EDIFICAÇÃO QUE POSSUA RESERVATÓRIO DE FIBRA/FIBROCIMENTO   FORNECIMENTO E INSTALAÇÃO. AF_06/2016","UN",1,null,null,null,""]
["S",4,"S",0,1,7,3,2,0,0,0,"F","Serviço","Serviço","1.7.3.2.2.","SINAPI",89538,"ADAPTADOR CURTO COM BOLSA E ROSCA PARA REGISTRO, PVC, SOLDÁVEL, DN 25MM X 3/4\u0094, INSTALADO EM PRUMADA DE ÁGUA - FORNECIMENTO E INSTALAÇÃO. AF_12/2014","UN",9,null,null,null,""]
["S",4,"S",0,1,7,3,2,0,0,0,"F","Serviço","Serviço","1.7.3.2.3.","SINAPI",89596,"ADAPTADOR CURTO COM BOLSA E ROSCA PARA REGISTRO, PVC, SOLDÁVEL, DN 50MM X 1.1/2\u0094, INSTALADO EM PRUMADA DE ÁGUA - FORNECIMENTO E INSTALAÇÃO. AF_12/2014","UN",15,null,null,null,"Referência: AGETOP - 81069"]
[{"$f":"CHOOSE(1+LOG(1+2*(ORÇAMENTO.Nivel=\"Nível 1\")+4*(ORÇAMENTO.Nivel=\"Nível 2\")+8*(ORÇAMENTO.Nivel=\"Nível 3\")+16*(ORÇAMENTO.Nivel=\"Nível 4\")+32*(ORÇAMENTO.Nivel=\"Serviço\"),2),0,1,2,3,4,\"S\")","v":"S"},4,"S",0,1,7,3,2,0,0,0,"F","Serviço","Serviço","1.7.3.2.4.","SINAPI",89613,"ADAPTADOR CURTO COM BOLSA E ROSCA PARA REGISTRO, PVC, SOLDÁVEL, DN 75MM X 2.1/2\u0094, INSTALADO EM PRUMADA DE ÁGUA - FORNECIMENTO E INSTALAÇÃO. AF_12/2014","UN",2,null,null,null,"Referência: AGETOP - 81071"]
[4,4,4,2,1,7,3,3,0,20,2,"F","Nível 4","Nível 4","1.7.3.3.","SINAPI",null,"LUVAS DE PVC","-",null,null,null,null,""]
["S",4,"S",0,1,7,3,3,0,0,0,"F","Serviço","Serviço","1.7.3.3.1.","SINAPI",89528,"LUVA, PVC, SOLDÁVEL, DN 25MM, INSTALADO EM PRUMADA DE ÁGUA - FORNECIMENTO E INSTALAÇÃO. AF_12/2014","UN",5,null,null,null,""]
[4,4,4,2,1,7,3,4,0,18,2,"F","Nível 4","Nível 4","1.7.3.4.","SINAPI",null,"BUCHAS","-",null,null,null,null,""]
["S",4,"S",0,1,7,3,4,0,0,0,"F","Serviço","Serviço","1.7.3.4.1.","AGETOP",81185,"BUCHA DE REDUÇÃO SOLDÁVEL LONGA 75 X 50 MM","un    ",1,null,null,null,""]
[4,4,4,2,1,7,3,5,0,16,2,"F","Nível 4","Nível 4","1.7.3.5.","SINAPI",null,"CAP","-",null,null,null,null,""]
["S",4,"S",0,1,7,3,5,0,0,0,"F","Serviço","Serviço","1.7.3.5.1.","SINAPI",72293,"CAP PVC ESGOTO 50MM (TAMPÃO) - FORNECIMENTO E INSTALAÇÃO","UN",1,null,null,null,""]
[4,4,4,5,1,7,3,6,0,14,5,"F","Nível 4","Nível 4","1.7.3.6.","SINAPI",null,"JOELHO","-",null,null,null,null,""]
["S",4,"S",0,1,7,3,6,0,0,0,"F","Serviço","Serviço","1.7.3.6.1.","SINAPI",89501,"JOELHO 90 GRAUS, PVC, SOLDÁVEL, DN 50MM, INSTALADO EM PRUMADA DE ÁGUA - FORNECIMENTO E INSTALAÇÃO. AF_12/2014","UN",14,null,null,null,""]
["S",4,"S",0,1,7,3,6,0,0,0,"F","Serviço","Serviço","1.7.3.6.2.","SINAPI",89513,"JOELHO 90 GRAUS, PVC, SOLDÁVEL, DN 75MM, INSTALADO EM PRUMADA DE ÁGUA - FORNECIMENTO E INSTALAÇÃO. AF_12/2014","UN",8,null,null,null,"Referência: AGETOP - 81326"]
["S",4,"S",0,1,7,3,6,0,0,0,"F","Serviço","Serviço","1.7.3.6.3.","AGETOP",81360,"JOELHO RED.90 GRAUS SOLD.C/BUCHA LATAO 25X1/2\"","Un    ",21,null,null,null,""]
["S",4,"S",0,1,7,3,6,0,0,0,"F","Serviço","Serviço","1.7.3.6.4.","SINAPI",94672,"JOELHO 90 GRAUS COM BUCHA DE LATÃO, PVC, SOLDÁVEL, DN  25 MM, X 3/4\u0094 INSTALADO EM RESERVAÇÃO DE ÁGUA DE EDIFICAÇÃO QUE POSSUA RESERVATÓRIO DE FIBRA/FIBROCIMENTO   FORNECIMENTO E INSTALAÇÃO. AF_06/2016","UN",2,null,null,null,""]
[4,4,4,3,1,7,3,7,0,9,3,"F","Nível 4","Nível 4","1.7.3.7.","SINAPI",null,"TÊ","-",null,null,null,null,""]
["S",4,"S",0,1,7,3,7,0,0,0,"F","Serviço","Serviço","1.7.3.7.1.","SINAPI",94698,"TÊ DE REDUÇÃO, PVC, SOLDÁVEL, DN 75 MM X 50 MM, INSTALADO EM RESERVAÇÃO DE ÁGUA DE EDIFICAÇÃO QUE POSSUA RESERVATÓRIO DE FIBRA/FIBROCIMENTO   FORNECIMENTO E INSTALAÇÃO. AF_06/2016","UN",1,null,null,null,"Referência: AGETOP - 81427"]
["S",4,"S",0,1,7,3,7,0,0,0,"F","Serviço","Serviço","1.7.3.7.2.","AGETOP",81445,"TE RED.SOLD.90GR.BUC.LATAO BOLSA CENT.25X25X1/2\"","Un    ",1,null,null,null,""]
[4,4,4,3,1,7,3,8,0,6,3,"F","Nível 4","Nível 4","1.7.3.8.","SINAPI",null,"ADESIVOS","-",null,null,null,null,""]
["S",4,"S",0,1,7,3,8,0,0,0,"F","Serviço","Serviço","1.7.3.8.1.","AGETOP",81501,"ADESIVO PLASTICO - FRASCO 850 G","Un    ",6,null,null,null,""]
["S",4,"S",0,1,7,3,8,0,0,0,"F","Serviço","Serviço","1.7.3.8.2.","AGETOP",81504,"SOLUCAO LIMPADORA 1000 CM3","Un    ",6,null,null,null,""]
[4,4,4,3,1,7,3,9,0,3,{"$error":"#N/A"},"F","Nível 4","Nível 4","1.7.3.9.","SINAPI",null,"CURVAS","-",null,null,null,null,""]
["S",4,"S",0,1,7,3,9,0,0,0,"F","Serviço","Serviço","1.7.3.9.1.","SINAPI",89499,"CURVA 90 GRAUS, PVC, SOLDÁVEL, DN 40MM, INSTALADO EM PRUMADA DE ÁGUA - FORNECIMENTO E INSTALAÇÃO. AF_12/2014","UN",13,null,null,null,""]
["S",4,"S",0,1,7,3,9,0,0,0,"F","Serviço","Serviço","1.7.3.9.2.","SINAPI",89503,"CURVA 90 GRAUS, PVC, SOLDÁVEL, DN 50MM, INSTALADO EM PRUMADA DE ÁGUA - FORNECIMENTO E INSTALAÇÃO. AF_12/2014","UN",7,null,null,null,""]
[3,3,3,10,1,7,4,0,0,54,10,"F","Nível 3","Nível 3","1.7.4.","SINAPI",null,"ÁGUA FRIA - LABORATÓRIO DE CIÊNCIAS","-",null,null,null,null,""]
["S",3,"S",0,1,7,4,0,0,0,0,"F","Serviço","Serviço","1.7.4.0.1.","SINAPI",89402,"TUBO, PVC, SOLDÁVEL, DN 25MM, INSTALADO EM RAMAL DE DISTRIBUIÇÃO DE ÁGUA - FORNECIMENTO E INSTALAÇÃO. AF_12/2014","M",28,null,null,null,"Referência: AGETOP - 81003"]
["S",3,"S",0,1,7,4,0,0,0,0,"F","Serviço","Serviço","1.7.4.0.2.","SINAPI",89447,"TUBO, PVC, SOLDÁVEL, DN 32MM, INSTALADO EM PRUMADA DE ÁGUA - FORNECIMENTO E INSTALAÇÃO. AF_12/2014","M",22,null,null,null,""]
["S",3,"S",0,1,7,4,0,0,0,0,"F","Serviço","Serviço","1.7.4.0.3.","AGETOP",80556,"LIGAÇÃO FLEXÍVEL PVC DIAM.1/2\" (ENGATE)","Un    ",3,null,null,null,""]
["S",3,"S",0,1,7,4,0,0,0,0,"F","Serviço","Serviço","1.7.4.0.4.","SINAPI",89538,"ADAPTADOR CURTO COM BOLSA E ROSCA PARA REGISTRO, PVC, SOLDÁVEL, DN 25MM X 3/4\u0094, INSTALADO EM PRUMADA DE ÁGUA - FORNECIMENTO E INSTALAÇÃO. AF_12/2014","UN",6,null,null,null,""]
["S",3,"S",0,1,7,4,0,0,0,0,"F","Serviço","Serviço","1.7.4.0.5.","SINAPI",96662,"BUCHA DE REDUÇÃO, PPR, 32 X 25, CLASSE PN 25, INSTALADO EM RAMAL DE DISTRIBUIÇÃO DE ÁGUA \u0096 FORNECIMENTO E INSTALAÇÃO . AF_06/2015","UN",3,null,null,null,""]
["S",3,"S",0,1,7,4,0,0,0,0,"F","Serviço","Serviço","1.7.4.0.6.","SINAPI",89481,"JOELHO 90 GRAUS, PVC, SOLDÁVEL, DN 25MM, INSTALADO EM PRUMADA DE ÁGUA - FORNECIMENTO E INSTALAÇÃO. AF_12/2014","UN",6,null,null,null,""]
["S",3,"S",0,1,7,4,0,0,0,0,"F","Serviço","Serviço","1.7.4.0.7.","SINAPI",89413,"JOELHO 90 GRAUS, PVC, SOLDÁVEL, DN 32MM, INSTALADO EM RAMAL DE DISTRIBUIÇÃO DE ÁGUA - FORNECIMENTO E INSTALAÇÃO. AF_12/2014","UN",1,null,null,null,"Referência: AGETOP - 81322"]
["S",3,"S",0,1,7,4,0,0,0,0,"F","Serviço","Serviço","1.7.4.0.8.","AGETOP",81369,"JOELHO 90 GRAUS SOLD. C/BUCHA LATAO 25 X 3/4\"","Un    ",3,null,null,null,""]
["S",3,"S",0,1,7,4,0,0,0,0,"F","Serviço","Serviço","1.7.4.0.9.","SINAPI",89443,"TE, PVC, SOLDÁVEL, DN 32MM, INSTALADO EM RAMAL DE DISTRIBUIÇÃO DE ÁGUA - FORNECIMENTO E INSTALAÇÃO. AF_12/2014","UN",2,null,null,null,"Referência: AGETOP - 81403"]
[3,3,3,29,1,7,5,0,0,44,29,"F","Nível 3","Nível 3","1.7.5.","SINAPI",null,"ESGOTO SANITÁRIO - REFORMA HIDRÁULICA","-",null,null,null,null,""]
[4,4,4,3,1,7,5,1,0,28,3,"F","Nível 4","Nível 4","1.7.5.1.","SINAPI",null,"CORPO DE CAIXA SIFONADA / RALO","-",null,null,null,null,""]
["S",4,"S",0,1,7,5,1,0,0,0,"F","Serviço","Serviço","1.7.5.1.1.","AGETOP",81663,"CORPO CX. SIFONADA DIAM. 150 X 150 X 50","Un    ",4,null,null,null,""]
["S",4,"S",0,1,7,5,1,0,0,0,"F","Serviço","Serviço","1.7.5.1.2.","AGETOP",81679,"CORPO RALO SIFONADO CONICO DIAM. 100 X 40","Un    ",5,null,null,null,""]
[4,4,4,7,1,7,5,2,0,25,7,"F","Nível 4","Nível 4","1.7.5.2.","SINAPI",null,"JOELHOS","-",null,null,null,null,""]
["S",4,"S",0,1,7,5,2,0,0,0,"F","Serviço","Serviço","1.7.5.2.1.","SINAPI",89726,"JOELHO 45 GRAUS, PVC, SERIE NORMAL, ESGOTO PREDIAL, DN 40 MM, JUNTA SOLDÁVEL, FORNECIDO E INSTALADO EM RAMAL DE DESCARGA OU RAMAL DE ESGOTO SANITÁRIO. AF_12/2014","UN",10,null,null,null,""]
["S",4,"S",0,1,7,5,2,0,0,0,"F","Serviço","Serviço","1.7.5.2.2.","SINAPI",89802,"JOELHO 45 GRAUS, PVC, SERIE NORMAL, ESGOTO PREDIAL, DN 50 MM, JUNTA ELÁSTICA, FORNECIDO E INSTALADO EM PRUMADA DE ESGOTO SANITÁRIO OU VENTILAÇÃO. AF_12/2014","UN",5,null,null,null,""]
["S",4,"S",0,1,7,5,2,0,0,0,"F","Serviço","Serviço","1.7.5.2.3.","SINAPI",89810,"JOELHO 45 GRAUS, PVC, SERIE NORMAL, ESGOTO PREDIAL, DN 100 MM, JUNTA ELÁSTICA, FORNECIDO E INSTALADO EM PRUMADA DE ESGOTO SANITÁRIO OU VENTILAÇÃO. AF_12/2014","UN",4,null,null,null,""]
["S",4,"S",0,1,7,5,2,0,0,0,"F","Serviço","Serviço","1.7.5.2.4.","SINAPI",89731,"JOELHO 90 GRAUS, PVC, SERIE NORMAL, ESGOTO PREDIAL, DN 50 MM, JUNTA ELÁSTICA, FORNECIDO E INSTALADO EM RAMAL DE DESCARGA OU RAMAL DE ESGOTO SANITÁRIO. AF_12/2014","UN",25,null,null,null,""]
["S",4,"S",0,1,7,5,2,0,0,0,"F","Serviço","Serviço","1.7.5.2.5.","SINAPI",89744,"JOELHO 90 GRAUS, PVC, SERIE NORMAL, ESGOTO PREDIAL, DN 100 MM, JUNTA ELÁSTICA, FORNECIDO E INSTALADO EM RAMAL DE DESCARGA OU RAMAL DE ESGOTO SANITÁRIO. AF_12/2014","UN",7,null,null,null,"Referência: AGETOP - 81938"]
["S",4,"S",0,1,7,5,2,0,0,0,"F","Serviço","Serviço","1.7.5.2.6.","AGETOP",81927,"JOELHO 90 GRAUS C/ANEL 40 mm ","Un    ",8,null,null,null,""]
[4,4,4,6,1,7,5,3,0,18,6,"F","Nível 4","Nível 4","1.7.5.3.","SINAPI",null,"JUNÇÕES","-",null,null,null,null,""]
["S",4,"S",0,1,7,5,3,0,0,0,"F","Serviço","Serviço","1.7.5.3.1.","AGETOP",81961,"JUNCAO 45 GRAUS DIAMETRO 40 MM","Un    ",5,null,null,null,""]
["S",4,"S",0,1,7,5,3,0,0,0,"F","Serviço","Serviço","1.7.5.3.2.","SINAPI",89785,"JUNÇÃO SIMPLES, PVC, SERIE NORMAL, ESGOTO PREDIAL, DN 50 X 50 MM, JUNTA ELÁSTICA, FORNECIDO E INSTALADO EM RAMAL DE DESCARGA OU RAMAL DE ESGOTO SANITÁRIO. AF_12/2014","UN",6,null,null,null,"Referência: AGETOP - 81970"]
["S",4,"S",0,1,7,5,3,0,0,0,"F","Serviço","Serviço","1.7.5.3.3.","AGETOP",81973,"JUNCAO SIMPLES DIAM. 100 X 50 MM","Un    ",4,null,null,null,""]
["S",4,"S",0,1,7,5,3,0,{"$f":"IF(OR($C339=\"S\",$C339=0),0,MATCH(0,OFFSET($D339,1,$C339,ROW($C$928)-ROW($C339)),0))","v":0},{"$f":"IF(OR($C339=\"S\",$C339=0),0,MATCH(OFFSET($D339,0,$C339)+1,OFFSET($D339,1,$C339,ROW($C$928)-ROW($C339)),0))","v":0},"F","Serviço","Serviço","1.7.5.3.4.","AGETOP",81974,"JUNCAO SIMPLES DIAMETRO 100 X 75 MM","Un    ",2,null,null,null,""]
["S",4,"S",0,1,7,5,3,0,0,0,"F","Serviço","Serviço","1.7.5.3.5.","SINAPI",89797,"JUNÇÃO SIMPLES, PVC, SERIE NORMAL, ESGOTO PREDIAL, DN 100 X 100 MM, JUNTA ELÁSTICA, FORNECIDO E INSTALADO EM RAMAL DE DESCARGA OU RAMAL DE ESGOTO SANITÁRIO. AF_12/2014","UN",3,null,null,null,"Referência: AGETOP - 81975"]
[4,4,4,5,1,7,5,4,0,12,5,"F","Nível 4","Nível 4","1.7.5.4.","SINAPI",null,"LUVAS","-",null,null,null,null,""]
["S",4,"S",0,1,7,5,4,0,0,0,"F","Serviço","Serviço","1.7.5.4.1.","SINAPI",89752,"LUVA SIMPLES, PVC, SERIE NORMAL, ESGOTO PREDIAL, DN 40 MM, JUNTA SOLDÁVEL, FORNECIDO E INSTALADO EM RAMAL DE DESCARGA OU RAMAL DE ESGOTO SANITÁRIO. AF_12/2014","UN",6,null,null,null,"Referência: AGETOP - 82001"]
["S",{"$f":"IF(OR(C343=\"s\",C343=0),OFFSET(B343,-1,0),C343)","v":4},{"$f":"IF(OFFSET(C343,-1,0)=\"L\",1,IF(OFFSET(C343,-1,0)=1,2,IF(OR(A343=\"s\",A343=0),\"S\",IF(AND(OFFSET(C343,-1,0)=2,A343=4),3,IF(AND(OR(OFFSET(C343,-1,0)=\"s\",OFFSET(C343,-1,0)=0),A343<>\"s\",A343>OFFSET(B343,-1,0)),OFFSET(B343,-1,0),A343)))))","v":"S"},{"$f":"IF(OR(C343=\"S\",C343=0),0,IF(ISERROR(K343),J343,SMALL(J343:K343,1)))","v":0},{"$f":"IF($C343=1,OFFSET(E343,-1,0)+1,OFFSET(E343,-1,0))","v":1},{"$f":"IF($C343=1,0,IF($C343=2,OFFSET(F343,-1,0)+1,OFFSET(F343,-1,0)))","v":7},{"$f":"IF(AND($C343<=2,$C343<>0),0,IF($C343=3,OFFSET(G343,-1,0)+1,OFFSET(G343,-1,0)))","v":5},{"$f":"IF(AND($C343<=3,$C343<>0),0,IF($C343=4,OFFSET(H343,-1,0)+1,OFFSET(H343,-1,0)))","v":4},{"$f":"IF(AND($C343<=4,$C343<>0),0,IF(AND($C343=\"S\",$W343>0),OFFSET(I343,-1,0)+1,OFFSET(I343,-1,0)))","v":0},0,0,"F","Serviço","Serviço","1.7.5.4.2.","SINAPI",89753,"LUVA SIMPLES, PVC, SERIE NORMAL, ESGOTO PREDIAL, DN 50 MM, JUNTA ELÁSTICA, FORNECIDO E INSTALADO EM RAMAL DE DESCARGA OU RAMAL DE ESGOTO SANITÁRIO. AF_12/2014","UN",11,null,null,null,"Referência: AGETOP - 82002"]
["S",4,"S",0,1,7,5,4,0,0,0,"F","Serviço","Serviço","1.7.5.4.3.","SINAPI",89774,"LUVA SIMPLES, PVC, SERIE NORMAL, ESGOTO PREDIAL, DN 75 MM, JUNTA ELÁSTICA, FORNECIDO E INSTALADO EM RAMAL DE DESCARGA OU RAMAL DE ESGOTO SANITÁRIO. AF_12/2014","UN",2,null,null,null,"Referência: AGETOP - 82003"]
["S",4,"S",0,1,7,5,4,0,0,0,"F","Serviço","Serviço","1.7.5.4.4.","SINAPI",89778,"LUVA SIMPLES, PVC, SERIE NORMAL, ESGOTO PREDIAL, DN 100 MM, JUNTA ELÁSTICA, FORNECIDO E INSTALADO EM RAMAL DE DESCARGA OU RAMAL DE ESGOTO SANITÁRIO. AF_12/2014","UN",22,null,null,null,"Referência: AGETOP - 82004"]
[4,4,4,2,1,7,5,5,0,7,2,"F","Nível 4","Nível 4","1.7.5.5.","SINAPI",null,"TÊ","-",null,null,null,null,""]
["S",4,"S",0,1,7,5,5,0,0,0,"F","Serviço","Serviço","1.7.5.5.1.","SINAPI",89825,"TE, PVC, SERIE NORMAL, ESGOTO PREDIAL, DN 50 X 50 MM, JUNTA ELÁSTICA, FORNECIDO E INSTALADO EM PRUMADA DE ESGOTO SANITÁRIO OU VENTILAÇÃO. AF_12/2014","UN",4,null,null,null,""]
[4,4,4,5,1,7,5,6,0,5,{"$error":"#N/A"},"F","Nível 4","Nível 4","1.7.5.6.","SINAPI",null,"TUBOS","-",null,null,null,null,""]
["S",4,"S",0,1,7,5,6,0,0,0,"F","Serviço","Serviço","1.7.5.6.1.","SINAPI",89711,"TUBO PVC, SERIE NORMAL, ESGOTO PREDIAL, DN 40 MM, FORNECIDO E INSTALADO EM RAMAL DE DESCARGA OU RAMAL DE ESGOTO SANITÁRIO. AF_12/2014","M",36,null,null,null,"Referência: AGETOP - 82301"]
["S",4,"S",0,1,7,5,6,0,0,0,"F","Serviço","Serviço","1.7.5.6.2.","SINAPI",89798,"TUBO PVC, SERIE NORMAL, ESGOTO PREDIAL, DN 50 MM, FORNECIDO E INSTALADO EM PRUMADA DE ESGOTO SANITÁRIO OU VENTILAÇÃO. AF_12/2014","M",66,null,null,null,""]
["S",4,"S",0,1,7,5,6,0,0,0,"F","Serviço","Serviço","1.7.5.6.3.","SINAPI",89799,"TUBO PVC, SERIE NORMAL, ESGOTO PREDIAL, DN 75 MM, FORNECIDO E INSTALADO EM PRUMADA DE ESGOTO SANITÁRIO OU VENTILAÇÃO. AF_12/2014","M",12,null,null,null,""]
["S",4,"S",0,1,7,5,6,0,0,0,"F","Serviço","Serviço","1.7.5.6.4.","SINAPI",89800,"TUBO PVC, SERIE NORMAL, ESGOTO PREDIAL, DN 100 MM, FORNECIDO E INSTALADO EM PRUMADA DE ESGOTO SANITÁRIO OU VENTILAÇÃO. AF_12/2014","M",132,null,null,null,""]
[3,3,3,6,1,7,6,0,0,15,6,"F","Nível 3","Nível 3","1.7.6.","SINAPI",null,"ESGOTO SANITÁRIO - LABORATÓRIO DE CIÊNCIAS","-",null,null,null,null,""]
["S",3,"S",0,1,7,6,0,0,0,0,"F","Serviço","Serviço","1.7.6.0.1.","AGETOP",81550,"CURVA 45º DIAMETRO 50 MM","Un    ",4,null,null,null,""]
["S",3,"S",0,1,7,6,0,0,0,0,"F","Serviço","Serviço","1.7.6.0.2.","SINAPI",89731,"JOELHO 90 GRAUS, PVC, SERIE NORMAL, ESGOTO PREDIAL, DN 50 MM, JUNTA ELÁSTICA, FORNECIDO E INSTALADO EM RAMAL DE DESCARGA OU RAMAL DE ESGOTO SANITÁRIO. AF_12/2014","UN",2,null,null,null,""]
["S",3,"S",0,1,7,6,0,0,0,0,"F","Serviço","Serviço","1.7.6.0.3.","AGETOP",81973,"JUNCAO SIMPLES DIAM. 100 X 50 MM","Un    ",2,null,null,null,""]
[{"$f":"CHOOSE(1+LOG(1+2*(ORÇAMENTO.Nivel=\"Nível 1\")+4*(ORÇAMENTO.Nivel=\"Nível 2\")+8*(ORÇAMENTO.Nivel=\"Nível 3\")+16*(ORÇAMENTO.Nivel=\"Nível 4\")+32*(ORÇAMENTO.Nivel=\"Serviço\"),2),0,1,2,3,4,\"S\")","v":"S"},3,"S",0,1,7,6,0,0,0,0,"F","Serviço","Serviço","1.7.6.0.4.","SINAPI",89798,"TUBO PVC, SERIE NORMAL, ESGOTO PREDIAL, DN 50 MM, FORNECIDO E INSTALADO EM PRUMADA DE ESGOTO SANITÁRIO OU VENTILAÇÃO. AF_12/2014","M",30,null,null,null,""]
["S",3,"S",0,1,7,6,0,0,0,0,"F","Serviço","Serviço","1.7.6.0.5.","SINAPI",89800,"TUBO PVC, SERIE NORMAL, ESGOTO PREDIAL, DN 100 MM, FORNECIDO E INSTALADO EM PRUMADA DE ESGOTO SANITÁRIO OU VENTILAÇÃO. AF_12/2014","M",14,null,null,null,""]
[3,3,3,9,1,7,7,0,0,9,156,"F","Nível 3","Nível 3","1.7.7.","SINAPI",null,"OUTROS","-",null,null,null,null,""]
[4,4,4,4,1,7,7,1,0,8,4,"F","Nível 4","Nível 4","1.7.7.1.","SINAPI",null,"REFORMA HIDRÁULICA","-",null,null,null,null,""]
["S",4,"S",0,1,7,7,1,0,0,0,"F","Serviço","Serviço","1.7.7.1.1.","AGETOP",81825,"CAIXA DE PASSAGEM 60 X 60 CM SEM TAMPA","Un    ",6,null,null,null,""]
["S",4,"S",0,1,7,7,1,0,0,0,"F","Serviço","Serviço","1.7.7.1.2.","AGETOP",81826,"TAMPA EM CONCRETO ARMADO 25 MPA E=5CM PARA A CAIXA DE PASSAGEM 60X60CM","Un    ",6,null,null,null,""]
["S",4,"S",0,1,7,7,1,0,0,0,"F","Serviço","Serviço","1.7.7.1.3.","AGETOP",81854,"CAIXA DE GORDURA 600 L. CONCRETO PADRÃO GOINFRA IMPERMEABILIZADA","un    ",2,null,null,null,""]
[4,4,4,4,1,7,7,2,0,4,{"$error":"#N/A"},"F","Nível 4","Nível 4","1.7.7.2.","SINAPI",null,"LABORATÓRIO DE CIÊNCIAS","-",null,null,null,null,""]
["S",4,"S",0,1,7,7,2,0,0,0,"F","Serviço","Serviço","1.7.7.2.1.","AGETOP",81825,"CAIXA DE PASSAGEM 60 X 60 CM SEM TAMPA","Un    ",1,null,null,null,""]
["S",4,"S",0,1,7,7,2,0,0,0,"F","Serviço","Serviço","1.7.7.2.2.","AGETOP",81826,"TAMPA EM CONCRETO ARMADO 25 MPA E=5CM PARA A CAIXA DE PASSAGEM 60X60CM","Un    ",1,null,null,null,""]
["S",4,"S",0,1,7,7,2,0,0,0,"F","Serviço","Serviço","1.7.7.2.3.","AGETOP",81885,"TERMINAL DE VENTILACAO DIAMETRO 50 MM","Un    ",1,null,null,null,""]
[2,2,2,71,1,8,0,0,0,249,71,"F","Nível 2","Nível 2","1.8.",null,null,"INSTALAÇÕES ESPECIAIS","-",null,null,null,null,""]
[3,3,3,26,1,8,1,0,0,70,26,"F","Nível 3","Nível 3","1.8.1.","SINAPI",null,"8. CENTRAL DE GÁS","-",null,null,null,null,""]
["S",3,"S",0,1,8,1,0,0,0,0,"F","Serviço","Serviço","1.8.1.0.1.","AGETOP",91007,"CENTRAL DE GÁS PADRÃO GOINFRA SEM INSTALAÇÕES (1+1 CILINDRO 45 KG)","Un    ",1,null,null,null,""]
["S",3,"S",0,1,8,1,0,0,0,0,"F","Serviço","Serviço","1.8.1.0.2.","AGETOP",91023,"UNIÃO S/BRONZE PRETA 3/4\" NPT 300 LBS","Un    ",3,null,null,null,""]
["S",3,"S",0,1,8,1,0,0,0,0,"F","Serviço","Serviço","1.8.1.0.3.","COMPOSIÇÃO","COMP 382_SEE","TE DE REDUCAO DE FERRO GALVANIZADO, COM ROSCA BSP, DE 3/4\" X 1/2\"","UN ",1,null,null,null,""]
["S",3,"S",0,1,8,1,0,0,0,0,"F","Serviço","Serviço","1.8.1.0.4.","COMPOSIÇÃO","COMP 383_SEE","BUCHA DE REDUCAO DE FERRO GALVANIZADO, COM ROSCA BSP, DE 1/2\" X 1/4\"","UN ",3,null,null,null,""]
["S",3,"S",0,1,8,1,0,0,0,0,"F","Serviço","Serviço","1.8.1.0.5.","AGETOP",91021,"LUVA GALVANIZADO DE REDUÇÃO 3/4\" X 1/2\" (GÁS)","Un    ",2,null,null,null,""]
["S",3,"S",0,1,8,1,0,0,0,0,"F","Serviço","Serviço","1.8.1.0.6.","SINAPI",92692,"NIPLE, EM FERRO GALVANIZADO, CONEXÃO ROSQUEADA, DN 15 (1/2\"), INSTALADO EM RAMAIS E SUB-RAMAIS DE GÁS - FORNECIMENTO E INSTALAÇÃO. AF_12/2015","UN",6,null,null,null,""]
["S",3,"S",0,1,8,1,0,0,0,0,"F","Serviço","Serviço","1.8.1.0.7.","AGETOP",91031,"NIPLE DUPLO 300 PSI 3/4\"","Un    ",6,null,null,null,""]
["S",3,"S",0,1,8,1,0,0,0,0,"F","Serviço","Serviço","1.8.1.0.8.","COMPOSIÇÃO","COMP 212_SEE","NIPLE DE REDUÇÃO 1/2\" X 1/4\" BSP","UN ",4,null,null,null,""]
["S",3,"S",0,1,8,1,0,0,0,0,"F","Serviço","Serviço","1.8.1.0.9.","COMPOSIÇÃO","COMP 213_SEE","NIPLE DE REDUÇÃO 3/4\" X 1/2\" BSP","UN ",4,null,null,null,""]
["S",3,"S",0,1,8,1,0,0,0,0,"F","Serviço","Serviço","1.8.1.0.10.","SINAPI",92688,"TUBO DE AÇO GALVANIZADO COM COSTURA, CLASSE MÉDIA, CONEXÃO ROSQUEADA, DN 20 (3/4\"), INSTALADO EM RAMAIS E SUB-RAMAIS DE GÁS - FORNECIMENTO E INSTALAÇÃO. AF_12/2015","M",18,null,null,null,""]
["S",3,"S",0,1,8,1,0,0,0,0,"F","Serviço","Serviço","1.8.1.0.11.","SINAPI",92701,"JOELHO 90 GRAUS, EM FERRO GALVANIZADO, CONEXÃO ROSQUEADA, DN 20 (3/4\"), INSTALADO EM RAMAIS E SUB-RAMAIS DE GÁS - FORNECIMENTO E INSTALAÇÃO. AF_12/2015","UN",11,null,null,null,""]
["S",3,"S",0,1,8,1,0,0,0,0,"F","Serviço","Serviço","1.8.1.0.12.","COMPOSIÇÃO","COMP 237_SEE","FITA ANTICORROSIVA","M",6,null,null,null,""]
["S",3,"S",0,1,8,1,0,0,0,0,"F","Serviço","Serviço","1.8.1.0.13.","AGETOP",91025,"VÁLVULA ESFERICA LATÃO 3/4\"","Un    ",3,null,null,null,""]
["S",3,"S",0,1,8,1,0,0,0,0,"F","Serviço","Serviço","1.8.1.0.14.","COMPOSIÇÃO","COMP 542_SEE","VÁLVULA UGV 3/4\" (S) LATÃO","UN ",4,null,null,null,""]
["S",3,"S",0,1,8,1,0,0,0,0,"F","Serviço","Serviço","1.8.1.0.15.","COMPOSIÇÃO","COMP 543_SEE","VÁLVULA UGV 1/2\" (S) LATÃO","UN ",1,null,null,null,""]
["S",3,"S",0,1,8,1,0,0,0,0,"F","Serviço","Serviço","1.8.1.0.16.","AGETOP",91029,"VALVULA DE RETENÇÃO LATÃO 1/2\" X 7/16\" NPT","Un    ",1,null,null,null,""]
["S",3,"S",0,1,8,1,0,0,0,0,"F","Serviço","Serviço","1.8.1.0.17.","COMPOSIÇÃO","COMP 211_SEE","REGULADOR DE 2º ESTÁGIO 5KG/H","UN ",4,null,null,null,""]
["S",3,"S",0,1,8,1,0,0,0,0,"F","Serviço","Serviço","1.8.1.0.18.","COMPOSIÇÃO","COMP 210_SEE","REGULADOR DE 1º ESTÁGIO 60KG/H MODELO AP-40  COM MANÔMETRO","UN ",1,null,null,null,""]
["S",3,"S",0,1,8,1,0,0,0,0,"F","Serviço","Serviço","1.8.1.0.19.","AGETOP",85003,"EXTINTOR PO QUIMICO SECO (6 KG) - CAPACIDADE EXTINTORA 20 BC","Un    ",1,null,null,null,""]
["S",3,"S",0,1,8,1,0,0,0,0,"F","Serviço","Serviço","1.8.1.0.20.","COMPOSIÇÃO","COMP 235_SEE","PLACA DE SINALIZAÇÃO EM PVC COD 01 - (300X300) PROIBIDO FUMAR","UN ",1,null,null,null,""]
["S",3,"S",0,1,8,1,0,0,0,0,"F","Serviço","Serviço","1.8.1.0.21.","COMPOSIÇÃO","COMP 236_SEE","PLACA DE SINALIZAÇÃO EM PVC COD 06 - (300X300) PERIGO INFLAMÁVEL","UN ",1,null,null,null,""]
["S",3,"S",0,1,8,1,0,0,0,0,"F","Serviço","Serviço","1.8.1.0.22.","AGETOP",91043,"BRAÇADEIRA METALICA TIPO \"D\" DIAM. 3/4\"","Un    ",5,null,null,null,""]
["S",3,"S",0,1,8,1,0,0,0,0,"F","Serviço","Serviço","1.8.1.0.23.","AGETOP",71863,"PARAFUSO P/BUCHA S-10","Un    ",10,null,null,null,""]
["S",3,"S",0,1,8,1,0,0,0,0,"F","Serviço","Serviço","1.8.1.0.24.","AGETOP",70393,"BUCHA DE NYLON S-10","Un    ",10,null,null,null,""]
["S",3,"S",0,1,8,1,0,0,0,0,"F","Serviço","Serviço","1.8.1.0.25.","AGETOP",91045,"SUPORTE PARA COLETOR","Un    ",2,null,null,null,""]
[3,3,3,44,1,8,2,0,0,44,49,"F","Nível 3","Nível 3","1.8.2.","SINAPI",null,"11. PREVENÇÃO E COMBATE A INCÊNDIO","-",null,null,null,null,""]
["S",3,"S",0,1,8,2,0,0,0,0,"F","Serviço","Serviço","1.8.2.0.1.","COMPOSIÇÃO","COMP 040_SEE","CONJUNTO MOTOR-BOMBA ELÉTRICA TRIFÁSICO 380/220 V PARA VZ= 24,33 M³/H, HM= 46,24 M POTÊNCIA= 7,5 CV","UN ",1,null,null,null,""]
["S",3,"S",0,1,8,2,0,0,0,0,"F","Serviço","Serviço","1.8.2.0.2.","AGETOP",81883,"RES.METALICO TAÇA AÇO PATINÁVEL-V=20M3-COL.SEC.H=6M+FUNDAÇÃO+LOGOTIPO","un    ",1,null,null,null,""]
["S",3,"S",0,1,8,2,0,0,0,0,"F","Serviço","Serviço","1.8.2.0.3.","AGETOP",81889,"TORNEIRA BOIA DIAMETRO 1\" (25 MM )","Un    ",1,null,null,null,""]
["S",3,"S",0,1,8,2,0,0,0,0,"F","Serviço","Serviço","1.8.2.0.4.","AGETOP",72338,"SIRENE METALICA ALCANCE 500 M","Un    ",1,null,null,null,""]
["S",3,"S",0,1,8,2,0,0,0,0,"F","Serviço","Serviço","1.8.2.0.5.","AGETOP",71156,"CURVA DE 90 GRAUS AÇO GALVANIZADO DIAM. 2.1/2\"","Un    ",1,null,null,null,""]
["S",3,"S",0,1,8,2,0,0,0,0,"F","Serviço","Serviço","1.8.2.0.6.","AGETOP",80910,"REGISTRO DE GAVETA BRUTO DIAMETRO 2.1/2\"","Un    ",2,null,null,null,""]
["S",3,"S",0,1,8,2,0,0,0,0,"F","Serviço","Serviço","1.8.2.0.7.","AGETOP",82379,"TUBO FERRO GALVANIZADO DIAM.2.1/2\"","m     ",320,null,null,null,""]
["S",3,"S",0,1,8,2,0,0,{"$f":"IF(OR($C403=\"S\",$C403=0),0,MATCH(0,OFFSET($D403,1,$C403,ROW($C$928)-ROW($C403)),0))","v":0},{"$f":"IF(OR($C403=\"S\",$C403=0),0,MATCH(OFFSET($D403,0,$C403)+1,OFFSET($D403,1,$C403,ROW($C$928)-ROW($C403)),0))","v":0},"F","Serviço","Serviço","1.8.2.0.8.","AGETOP",81003,"TUBO SOLDAVEL PVC MARROM DIAMETRO 25 mm","M     ",30,null,null,null,""]
["S",3,"S",0,1,8,2,0,0,0,0,"F","Serviço","Serviço","1.8.2.0.9.","AGETOP",81321,"JOELHO 90 GRAUS SOLDAVEL DIAMETRO 25 MM","Un    ",6,null,null,null,""]
["S",3,"S",0,1,8,2,0,0,0,0,"F","Serviço","Serviço","1.8.2.0.10.","AGETOP",85003,"EXTINTOR PO QUIMICO SECO (6 KG) - CAPACIDADE EXTINTORA 20 BC","Un    ",2,null,null,null,""]
["S",3,"S",0,1,8,2,0,0,0,0,"F","Serviço","Serviço","1.8.2.0.11.","AGETOP",85006,"EXTINTOR MULTI USO EM PO A B C (6 KG) - CAPACIDADE EXTINTORA 3A 20BC","un    ",9,null,null,null,""]
["S",3,"S",0,1,8,2,0,0,0,0,"F","Serviço","Serviço","1.8.2.0.12.","AGETOP",85011,"CAIXA DE INCÊNDIO METÁLICA COM SUPORTE PARA MANGUEIRA, TAMPA E MURETA 17X60X90 CM C/PINTURA","Un    ",5,null,null,null,""]
["S",3,"S",0,1,8,2,0,0,0,0,"F","Serviço","Serviço","1.8.2.0.13.","AGETOP",85017,"MANGUEIRA DE INCÊNDIO D.I. = 38 MM TIPO 2 COMP. = 15 M","CJ    ",10,null,null,null,""]
["S",3,"S",0,1,8,2,0,0,0,0,"F","Serviço","Serviço","1.8.2.0.14.","AGETOP",85025,"ESGUICHO REGULÁVEL 1.1/2\"","Un    ",5,null,null,null,""]
["S",3,"S",0,1,8,2,0,0,0,0,"F","Serviço","Serviço","1.8.2.0.15.","AGETOP",85027,"ADAPTADOR P/ENGATE STORZ 2.1/2\" X 1.1/2\"","Un    ",6,null,null,null,""]
["S",3,"S",0,1,8,2,0,0,0,0,"F","Serviço","Serviço","1.8.2.0.16.","AGETOP",85031,"REGISTRO GLOBO ANGULAR 2.1/2\"","Un    ",5,null,null,null,""]
["S",3,"S",0,1,8,2,0,0,0,0,"F","Serviço","Serviço","1.8.2.0.17.","AGETOP",85035,"TAMPÃO CEGO COM CORRENTE 2.1/2\"","Un    ",5,null,null,null,""]
["S",3,"S",0,1,8,2,0,0,0,0,"F","Serviço","Serviço","1.8.2.0.18.","AGETOP",85037,"TANQUE DE PRESSÃO DE 10 L","Un    ",1,null,null,null,""]
["S",3,"S",0,1,8,2,0,0,0,0,"F","Serviço","Serviço","1.8.2.0.19.","AGETOP",85039,"PRESSOSTATO 50 A 80 PSI","Un    ",1,null,null,null,""]
["S",3,"S",0,1,8,2,0,0,0,0,"F","Serviço","Serviço","1.8.2.0.20.","AGETOP",85041,"MANOMETRO - 0 A 10 KG/CM2","Un    ",1,null,null,null,""]
["S",3,"S",0,1,8,2,0,0,0,0,"F","Serviço","Serviço","1.8.2.0.21.","AGETOP",85047,"NIPLE DUPLO FERRO GALVANIZADO 2.1/2\"","Un    ",6,null,null,null,""]
["S",3,"S",0,1,8,2,0,0,0,0,"F","Serviço","Serviço","1.8.2.0.22.","SINAPI",92377,"NIPLE, EM FERRO GALVANIZADO, DN 65 (2 1/2\"), CONEXÃO ROSQUEADA, INSTALADO EM REDE DE ALIMENTAÇÃO PARA HIDRANTE - FORNECIMENTO E INSTALAÇÃO. AF_12/2015","UN",5,null,null,null,""]
["S",3,"S",0,1,8,2,0,0,0,0,"F","Serviço","Serviço","1.8.2.0.23.","AGETOP",85077,"VÁLVULA DE RETENÇÃO HORIZONTAL 2.1/2\"","Un    ",2,null,null,null,""]
["S",3,"S",0,1,8,2,0,0,0,0,"F","Serviço","Serviço","1.8.2.0.24.","COMPOSIÇÃO","COMP 017_SEE","REDUCAO GIRATÓRIA TIPO STORZ LATAO P/ INST. PREDIAL COMBATE A INCENDIO ENGATE RAPIDO 2.1/2\" X 1.1/2\"","UN ",5,null,null,null,""]
["S",3,"S",0,1,8,2,0,0,0,0,"F","Serviço","Serviço","1.8.2.0.25.","COMPOSIÇÃO","COMP 018_SEE","CHAVE DUPLA P/ CONEXÕES TIPO STORZ EM LATÃO ENGATE RÁPIDO 1 1/2\" X 2 1/2\"","UN ",5,null,null,null,""]
["S",3,"S",0,1,8,2,0,0,0,0,"F","Serviço","Serviço","1.8.2.0.26.","AGETOP",80981,"REGISTRO DE ESFERA DIAMETRO 2.1/2\"","Un    ",2,null,null,null,""]
["S",3,"S",0,1,8,2,0,0,0,0,"F","Serviço","Serviço","1.8.2.0.27.","COMPOSIÇÃO","COMP 087_SEE","REGISTRO DE GAVETA COM HASTE ASCENDENTE DE BRONZE 2 1/2\"","UN ",1,null,null,null,""]
["S",3,"S",0,1,8,2,0,0,0,0,"F","Serviço","Serviço","1.8.2.0.28.","AGETOP",85056,"TÊ DE FERRO GALVANIZADO 90º X 2 1/2\"","un    ",8,null,null,null,""]
["S",3,"S",0,1,8,2,0,0,0,0,"F","Serviço","Serviço","1.8.2.0.29.","COMPOSIÇÃO","COMP 030_SEE","COTOVELO DE FERRO GALV. 90° X 2 1/2\"","UN ",24,null,null,null,""]
["S",3,"S",0,1,8,2,0,0,0,0,"F","Serviço","Serviço","1.8.2.0.30.","COMPOSIÇÃO","COMP 077_SEE","UNIAO FERRO GALV C/ASSENTO CONICO BRONZE 2 1/2\"","UN ",6,null,null,null,""]
["S",3,"S",0,1,8,2,0,0,0,0,"F","Serviço","Serviço","1.8.2.0.31.","COMPOSIÇÃO","COMP 347_SEE","ADAPTADOR PVC SOLDAVEL, COM FLANGES LIVRES, 75 MM X 2 1/2\", PARA CAIXA D' AGUA","UN ",1,null,null,null,""]
["S",3,"S",0,1,8,2,0,0,0,0,"F","Serviço","Serviço","1.8.2.0.32.","COMPOSIÇÃO","COMP 022_SEE","TAMPÃO FOFO 40X50CM C/INSCRIÇÃO ","UN ",1,null,null,null,""]
["S",3,"S",0,1,8,2,0,0,0,0,"F","Serviço","Serviço","1.8.2.0.33.","COMPOSIÇÃO","COMP 546_SEE","BUJÃO DE REBORDO 2.1/2\"","UN ",1,null,null,null,""]
["S",3,"S",0,1,8,2,0,0,0,0,"F","Serviço","Serviço","1.8.2.0.34.","COMPOSIÇÃO","COMP 186_SEE","BOTOEIRA BOMBA DE INCÊNDIO C/ MARTELO CONVENCIONAL/ ANALÓGICA","UN ",1,null,null,null,""]
["S",3,"S",0,1,8,2,0,0,0,0,"F","Serviço","Serviço","1.8.2.0.35.","COMPOSIÇÃO","COMP 188_SEE","ACIONADOR MANUAL DE ALARME","UN ",3,null,null,null,""]
["S",3,"S",0,1,8,2,0,0,0,0,"F","Serviço","Serviço","1.8.2.0.36.","COMPOSIÇÃO","COMP 190_SEE","CENTRAL DE DETECÇÃO E ALARME DE 40 SETORES COM BATERIA","UN ",1,null,null,null,""]
["S",3,"S",0,1,8,2,0,0,0,0,"F","Serviço","Serviço","1.8.2.0.37.","SINAPI",97599,"LUMINÁRIA DE EMERGÊNCIA - FORNECIMENTO E INSTALAÇÃO. AF_11/2017","UN",20,null,null,null,""]
["S",3,"S",0,1,8,2,0,0,0,0,"F","Serviço","Serviço","1.8.2.0.38.","COMPOSIÇÃO","COMP 024_SEE","SINALIZADOR FOTOLUMINESCENTE PARA EXTINTOR","UN ",11,null,null,null,""]
["S",3,"S",0,1,8,2,0,0,0,0,"F","Serviço","Serviço","1.8.2.0.39.","COMPOSIÇÃO","COMP 025_SEE","SINALIZADOR FOTOLUMINESCENTE DE EMERGÊNCIA","UN ",30,null,null,null,""]
["S",3,"S",0,1,8,2,0,0,0,0,"F","Serviço","Serviço","1.8.2.0.40.","COMPOSIÇÃO","COMP 277_SEE","MARCAÇÃO NO PISO - 1X1 M PARA EXTINTOR","M2",11,null,null,null,""]
["S",3,"S",0,1,8,2,0,0,0,0,"F","Serviço","Serviço","1.8.2.0.41.","COMPOSIÇÃO","COMP 235_SEE","PLACA DE SINALIZAÇÃO EM PVC COD 01 - (300X300) PROIBIDO FUMAR","UN ",1,null,null,null,""]
["S",3,"S",0,1,8,2,0,0,0,0,"F","Serviço","Serviço","1.8.2.0.42.","COMPOSIÇÃO","COMP 236_SEE","PLACA DE SINALIZAÇÃO EM PVC COD 06 - (300X300) PERIGO INFLAMÁVEL","UN ",1,null,null,null,""]
["S",3,"S",0,1,8,2,0,0,0,0,"F","Serviço","Serviço","1.8.2.0.43.","COMPOSIÇÃO","COMP 412_SEE","PLACA DE SINALIZAÇÃO EM PVC COD 17 - (316X158) MENSAGEM \"SAÍDA\"","UN ",3,null,null,null,""]
[2,2,2,19,1,9,0,0,0,178,19,"F","Nível 2","Nível 2","1.9.","AGETOP",91045,"ALVENARIAS E DIVISÓRIAS","Un    ",null,null,null,null,""]
[3,3,3,2,1,9,1,0,0,18,2,"F","Nível 3","Nível 3","1.9.1.","SINAPI",null,"1.2 AMPLIAÇÃO SALAS ADAPTADAS","-",null,null,null,null,""]
["S",3,"S",0,1,9,1,0,0,0,0,"F","Serviço","Serviço","1.9.1.0.1.","AGETOP",100201,"ALVENARIA DE TIJOLO FURADO 1/2 VEZ - 9 x 19 x 19 - ARG. (1CALH:4ARML+100KG DE CI/M3)","m2    ",7.22,null,null,null,""]
[3,3,3,2,1,9,2,0,0,16,2,"F","Nível 3","Nível 3","1.9.2.","SINAPI",72132,"1.3 QUADRA DESCOBERTA","M2",null,null,null,null,""]
["S",3,"S",0,1,9,2,0,0,0,0,"F","Serviço","Serviço","1.9.2.0.1.","AGETOP",100102,"ALVENARIA DE TIJOLO COMUM 1/2 VEZ - ARG. (1CI : 2CH : 8ARML)","m2    ",1.1499999999999999,null,null,null,""]
[3,3,3,2,1,9,3,0,0,14,2,"F","Nível 3","Nível 3","1.9.3.","SINAPI",93202,"2. RAMPA E ESCADA","M",null,null,null,null,"Referência: AGETOP - 100204"]
["S",3,"S",0,1,9,3,0,0,0,0,"F","Serviço","Serviço","1.9.3.0.1.","AGETOP",100201,"ALVENARIA DE TIJOLO FURADO 1/2 VEZ - 9 x 19 x 19 - ARG. (1CALH:4ARML+100KG DE CI/M3)","m2    ",5.95,null,null,null,""]
[3,3,3,4,1,9,4,0,0,12,4,"F","Nível 3","Nível 3","1.9.4.","AGETOP",100301,"3. VESTIÁRIOS FEMININO E MASCULINO","m2    ",null,null,null,null,""]
["S",3,"S",0,1,9,4,0,0,0,0,"F","Serviço","Serviço","1.9.4.0.1.","AGETOP",100201,"ALVENARIA DE TIJOLO FURADO 1/2 VEZ - 9 x 19 x 19 - ARG. (1CALH:4ARML+100KG DE CI/M3)","m2    ",40.1,null,null,null,""]
["S",3,"S",0,1,9,4,0,0,0,0,"F","Serviço","Serviço","1.9.4.0.2.","AGETOP",100602,"ALVENARIA DE TIJOLO LAMINADO 1/2 VEZ  - ARG. (1CI : 1CH : 5ARML)","m2    ",3.78,null,null,null,""]
["S",3,"S",0,1,9,4,0,0,0,0,"F","Serviço","Serviço","1.9.4.0.3.","AGETOP",100320,"DIVISORIA DE GRANITO POLIDO","m2    ",1.44,null,null,null,""]
[3,3,3,2,1,9,5,0,0,8,2,"F","Nível 3","Nível 3","1.9.5.","AGETOP",100303,"4. COZINHA","m2    ",null,null,null,null,""]
["S",3,"S",0,1,9,5,0,0,0,0,"F","Serviço","Serviço","1.9.5.0.1.","AGETOP",100201,"ALVENARIA DE TIJOLO FURADO 1/2 VEZ - 9 x 19 x 19 - ARG. (1CALH:4ARML+100KG DE CI/M3)","m2    ",72.8,null,null,null,""]
[3,3,3,4,1,9,6,0,0,6,4,"F","Nível 3","Nível 3","1.9.6.","AGETOP",100602,"6. SANITÁRIOS FEMININO E MASCULINO","m2    ",null,null,null,null,""]
["S",3,"S",0,1,9,6,0,0,0,0,"F","Serviço","Serviço","1.9.6.0.1.","AGETOP",100201,"ALVENARIA DE TIJOLO FURADO 1/2 VEZ - 9 x 19 x 19 - ARG. (1CALH:4ARML+100KG DE CI/M3)","m2    ",36.31,null,null,null,""]
["S",3,"S",0,1,9,6,0,0,0,0,"F","Serviço","Serviço","1.9.6.0.2.","AGETOP",100602,"ALVENARIA DE TIJOLO LAMINADO 1/2 VEZ  - ARG. (1CI : 1CH : 5ARML)","m2    ",16.53,null,null,null,""]
["S",3,"S",0,1,9,6,0,0,0,0,"F","Serviço","Serviço","1.9.6.0.3.","AGETOP",100320,"DIVISORIA DE GRANITO POLIDO","m2    ",1.8,null,null,null,""]
[3,3,3,2,1,9,7,0,0,2,59,"F","Nível 3","Nível 3","1.9.7.","SINAPI",null,"MURO DE ARRIMO","-",null,null,null,null,""]
["S",3,"S",0,1,9,7,0,0,0,0,"F","Serviço","Serviço","1.9.7.0.1.","AGETOP",110106,"CORTINA CANALETA CONCRETO 14X19X19 PARA SER CHEIA CONCRETO ARMADO (0,0568M3/M2) - EXCLUSO O CONCRETO","m2    ",8.6999999999999993,null,null,null,""]
[2,2,2,7,1,10,0,0,0,159,7,"F","Nível 2","Nível 2","1.10.",null,null,"IMPERMEABILIZAÇÃO","-",null,null,null,null,""]
[3,3,3,2,1,10,1,0,0,6,2,"F","Nível 3","Nível 3","1.10.1.","AGETOP",null,"MURO DE ARRIMO","-",null,null,null,null,""]
["S",3,"S",0,1,10,1,0,0,0,0,"F","Serviço","Serviço","1.10.1.0.1.","AGETOP",120902,"IMPERMEABILIZACAO VIGAS BALDRAMES E=2,0 CM","m2    ",12.333333333333334,null,null,null,""]
[3,3,3,2,1,10,2,0,0,4,2,"F","Nível 3","Nível 3","1.10.2.","AGETOP",null,"COZINHA","-",null,null,null,null,""]
["S",3,"S",0,1,10,2,0,0,0,0,"F","Serviço","Serviço","1.10.2.0.1.","AGETOP",120902,"IMPERMEABILIZACAO VIGAS BALDRAMES E=2,0 CM","m2    ",17.485714285714288,null,null,null,""]
[3,3,3,2,1,10,3,0,0,2,12,"","Nível 3","Nível 3","-","SINAPI",null,"BANHEIRO","-",null,null,null,null,""]
["S",3,"S",0,1,10,3,0,0,0,0,"","Serviço","Serviço","-","AGETOP",120902,"IMPERMEABILIZACAO VIGAS BALDRAMES E=2,0 CM","m2    ",null,null,null,null,""]
[2,2,2,3,1,11,0,0,0,152,3,"F","Nível 2","Nível 2","1.11.",null,null,"COBERTURAS","-",null,null,null,null,""]
[3,3,3,2,1,11,1,0,0,2,5,"F","Nível 3","Nível 3","1.11.1.",null,null,"1.2 AMPLIAÇÃO SALAS ADAPTADAS","-",null,null,null,null,""]
["S",3,"S",0,1,11,1,0,0,{"$f":"IF(OR($C467=\"S\",$C467=0),0,MATCH(0,OFFSET($D467,1,$C467,ROW($C$928)-ROW($C467)),0))","v":0},{"$f":"IF(OR($C467=\"S\",$C467=0),0,MATCH(OFFSET($D467,0,$C467)+1,OFFSET($D467,1,$C467,ROW($C$928)-ROW($C467)),0))","v":0},"F","Serviço","Serviço","1.11.1.0.1.","AGETOP",160601,"CALHA DE CHAPA GALVANIZADA","m     ",33.1,null,null,null,""]
[2,2,2,18,1,12,0,0,0,149,18,"F","Nível 2","Nível 2","1.12.",null,null,"ESQUADRIAS METÁLICAS","-",null,null,null,null,""]
[3,3,3,2,1,12,1,0,0,17,2,"F","Nível 3","Nível 3","1.12.1.","SINAPI",null,"1. REFORMA E AMPLIAÇÃO","-",null,null,null,null,""]
["S",3,"S",0,1,12,1,0,0,0,0,"F","Serviço","Serviço","1.12.1.0.1.","AGETOP",180307,"PORTAO /CHAPA TRAPEZ / TUBO DE ACO PT-5 C/FERRAGEM","m2    ",2.4,null,null,null,""]
[3,3,3,2,1,12,2,0,0,15,2,"F","Nível 3","Nível 3","1.12.2.","SINAPI",null,"1.3 QUADRA DESCOBERTA","-",null,null,null,null,""]
["S",3,"S",0,1,12,2,0,0,0,0,"F","Serviço","Serviço","1.12.2.0.1.","AGETOP",180308,"PORTAO CHAPA 14 / GRADE DE FERRO PT-7 C/FERRAGENS","m2    ",6,null,null,null,""]
[3,3,3,2,1,12,3,0,0,13,2,"F","Nível 3","Nível 3","1.12.3.","SINAPI",null,"2. RAMPA E ESCADA","-",null,null,null,null,""]
["S",3,"S",0,1,12,3,0,0,0,0,"F","Serviço","Serviço","1.12.3.0.1.","COMPOSIÇÃO","COMP 083_SEE","CORRIMÃO PISO - SEDUC","M",1.3,null,null,null,""]
[3,3,3,2,1,12,4,0,0,11,2,"F","Nível 3","Nível 3","1.12.4.","AGETOP",180323,"3. VESTIÁRIOS FEMININO E MASCULINO","m2    ",null,null,null,null,""]
["S",3,"S",0,1,12,4,0,0,0,0,"F","Serviço","Serviço","1.12.4.0.1.","AGETOP",180501,"PORTA DE ABRIR EM CHAPA PF-1 C/FERRAGENS","m2    ",18.600000000000001,null,null,null,""]
[3,3,3,5,1,12,5,0,0,9,5,"F","Nível 3","Nível 3","1.12.5.","SINAPI",94562,"4. COZINHA","M2",null,null,null,null,"Referência: AGETOP - 180401"]
["S",3,"S",0,1,12,5,0,0,0,0,"F","Serviço","Serviço","1.12.5.0.1.","AGETOP",180501,"PORTA DE ABRIR EM CHAPA PF-1 C/FERRAGENS","m2    ",15.54,null,null,null,""]
["S",3,"S",0,1,12,5,0,0,0,0,"F","Serviço","Serviço","1.12.5.0.2.","AGETOP",180303,"PORTA DE ENROLAR C/FERRAGENS","m2    ",10,null,null,null,""]
["S",3,"S",0,1,12,5,0,0,0,0,"F","Serviço","Serviço","1.12.5.0.3.","AGETOP",180381,"ESQ. MAXIMO AR CHAPA/VIDRO J3/J5/J6/J8 C/FERRAGENS","m2    ",14.4,null,null,null,""]
["S",3,"S",0,1,12,5,0,0,0,0,"F","Serviço","Serviço","1.12.5.0.4.","AGETOP",230210,"DOBRADICA C/MOLA P/PORTA/DIVISORIAS","Un    ",2,null,null,null,""]
[3,3,3,2,1,12,6,0,0,4,2,"F","Nível 3","Nível 3","1.12.6.","SINAPI",null,"5. RAMPA","-",null,null,null,null,""]
["S",3,"S",0,1,12,6,0,0,0,0,"F","Serviço","Serviço","1.12.6.0.1.","COMPOSIÇÃO","COMP 083_SEE","CORRIMÃO PISO - SEDUC","M",10.1,null,null,null,""]
[3,3,3,2,1,12,7,0,0,2,31,"F","Nível 3","Nível 3","1.12.7.","SINAPI","73933/4","6. SANITÁRIO FEMININO E MASCULINO","M2",null,null,null,null,"Referência: AGETOP - 180501"]
["S",3,"S",0,1,12,7,0,0,0,0,"F","Serviço","Serviço","1.12.7.0.1.","AGETOP",180501,"PORTA DE ABRIR EM CHAPA PF-1 C/FERRAGENS","m2    ",3.42,null,null,null,""]
[2,2,2,3,1,13,0,0,0,131,3,"F","Nível 2","Nível 2","1.13.",null,null,"VIDROS","-",null,null,null,null,""]
[3,3,3,2,1,13,1,0,0,2,6,"F","Nível 3","Nível 3","1.13.1.","SINAPI",null,"4. COZINHA","-",null,null,null,null,""]
["S",3,"S",0,1,13,1,0,0,0,0,"F","Serviço","Serviço","1.13.1.0.1.","AGETOP",190102,"VIDRO LISO 4 MM - COLOCADO","m2    ",14.4,null,null,null,""]
[2,2,2,33,1,14,0,0,0,128,33,"F","Nível 2","Nível 2","1.14.",null,null,"REVESTIMENTO DE PAREDE","-",null,null,null,null,""]
[3,3,3,3,1,14,1,0,0,32,3,"F","Nível 3","Nível 3","1.14.1.","SINAPI",null,"1. REFORMA E AMPLIAÇÃO","-",null,null,null,null,""]
["S",3,"S",0,1,14,1,0,0,0,0,"F","Serviço","Serviço","1.14.1.0.1.","AGETOP",200101,"CHAPISCO COMUM","m2    ",32.5,null,null,null,""]
["S",3,"S",0,1,14,1,0,0,0,0,"F","Serviço","Serviço","1.14.1.0.2.","AGETOP",200500,"REBOCO PAULISTA A-7 (1 CALH,4 ARMLC)","m2    ",32.5,null,null,null,""]
[3,3,3,4,1,14,2,0,0,29,4,"F","Nível 3","Nível 3","1.14.2.","SINAPI",null,"1.2 AMPLIAÇÃO SALAS ADAPTADAS","-",null,null,null,null,""]
["S",3,"S",0,1,14,2,0,0,0,0,"F","Serviço","Serviço","1.14.2.0.1.","AGETOP",200101,"CHAPISCO COMUM","m2    ",14.44,null,null,null,""]
["S",3,"S",0,1,14,2,0,0,0,0,"F","Serviço","Serviço","1.14.2.0.2.","AGETOP",200201,"EMBOÇO (1CI:4 ARML)","m2    ",73.739999999999995,null,null,null,""]
["S",3,"S",0,1,14,2,0,0,0,0,"F","Serviço","Serviço","1.14.2.0.3.","AGETOP",201302,"REVESTIMENTO COM CERÂMICA ","m2    ",73.739999999999995,null,null,null,""]
[3,3,3,3,1,14,3,0,0,25,3,"F","Nível 3","Nível 3","1.14.3.","SINAPI",null,"1.3 QUADRA DESCOBERTA","-",null,null,null,null,""]
["S",3,"S",0,1,14,3,0,0,0,0,"F","Serviço","Serviço","1.14.3.0.1.","AGETOP",200101,"CHAPISCO COMUM","m2    ",3.15,null,null,null,""]
["S",3,"S",0,1,14,3,0,0,0,0,"F","Serviço","Serviço","1.14.3.0.2.","AGETOP",200500,"REBOCO PAULISTA A-7 (1 CALH,4 ARMLC)","m2    ",3.15,null,null,null,""]
[3,3,3,3,1,14,4,0,0,22,3,"F","Nível 3","Nível 3","1.14.4.","SINAPI",null,"2. RAMPA E ESCADA","-",null,null,null,null,""]
["S",3,"S",0,1,14,4,0,0,0,0,"F","Serviço","Serviço","1.14.4.0.1.","AGETOP",200101,"CHAPISCO COMUM","m2    ",2.6,null,null,null,""]
["S",3,"S",0,1,14,4,0,0,0,0,"F","Serviço","Serviço","1.14.4.0.2.","AGETOP",200500,"REBOCO PAULISTA A-7 (1 CALH,4 ARMLC)","m2    ",2.6,null,null,null,""]
[3,3,3,5,1,14,5,0,0,19,5,"F","Nível 3","Nível 3","1.14.5.","AGETOP",200103,"3. VESTIÁRIOS FEMININO E MASCULINO","M     ",null,null,null,null,""]
["S",3,"S",0,1,14,5,0,0,0,0,"F","Serviço","Serviço","1.14.5.0.1.","AGETOP",200101,"CHAPISCO COMUM","m2    ",172,null,null,null,""]
["S",3,"S",0,1,14,5,0,0,0,0,"F","Serviço","Serviço","1.14.5.0.2.","AGETOP",200500,"REBOCO PAULISTA A-7 (1 CALH,4 ARMLC)","m2    ",3.78,null,null,null,""]
["S",3,"S",0,1,14,5,0,0,0,0,"F","Serviço","Serviço","1.14.5.0.3.","AGETOP",200201,"EMBOÇO (1CI:4 ARML)","m2    ",172,null,null,null,""]
["S",3,"S",0,1,14,5,0,0,0,0,"F","Serviço","Serviço","1.14.5.0.4.","AGETOP",201302,"REVESTIMENTO COM CERÂMICA ","m2    ",328.6,null,null,null,""]
[3,3,3,5,1,14,6,0,0,14,5,"F","Nível 3","Nível 3","1.14.6.","SINAPI",null,"4. COZINHA","-",null,null,null,null,""]
["S",3,"S",0,1,14,6,0,0,0,0,"F","Serviço","Serviço","1.14.6.0.1.","AGETOP",200101,"CHAPISCO COMUM","m2    ",145.6,null,null,null,""]
["S",3,"S",0,1,14,6,0,0,0,0,"F","Serviço","Serviço","1.14.6.0.2.","AGETOP",200500,"REBOCO PAULISTA A-7 (1 CALH,4 ARMLC)","m2    ",32.5,null,null,null,""]
["S",3,"S",0,1,14,6,0,0,0,0,"F","Serviço","Serviço","1.14.6.0.3.","AGETOP",200201,"EMBOÇO (1CI:4 ARML)","m2    ",310.48,null,null,null,""]
["S",3,"S",0,1,14,6,0,0,0,0,"F","Serviço","Serviço","1.14.6.0.4.","AGETOP",201302,"REVESTIMENTO COM CERÂMICA ","m2    ",310.48,null,null,null,""]
[3,3,3,2,1,14,7,0,0,9,2,"F","Nível 3","Nível 3","1.14.7.","SINAPI",null,"4.1 REFEITÓRIO","-",null,null,null,null,""]
["S",3,"S",0,1,14,7,0,0,0,0,"F","Serviço","Serviço","1.14.7.0.1.","AGETOP",201302,"REVESTIMENTO COM CERÂMICA ","m2    ",20,null,null,null,""]
[3,3,3,4,1,14,8,0,0,7,4,"F","Nível 3","Nível 3","1.14.8.","SINAPI",null,"6. SANITÁRIOS FEMININO E MASCULINO","-",null,null,null,null,""]
["S",3,"S",0,1,14,8,0,0,0,0,"F","Serviço","Serviço","1.14.8.0.1.","AGETOP",200101,"CHAPISCO COMUM","m2    ",55,null,null,null,""]
["S",3,"S",0,1,14,8,0,0,0,0,"F","Serviço","Serviço","1.14.8.0.2.","AGETOP",200201,"EMBOÇO (1CI:4 ARML)","m2    ",90,null,null,null,""]
["S",3,"S",0,1,14,8,0,0,0,0,"F","Serviço","Serviço","1.14.8.0.3.","AGETOP",201302,"REVESTIMENTO COM CERÂMICA ","m2    ",145,null,null,null,""]
[3,3,3,3,1,14,9,0,0,3,{"$error":"#N/A"},"F","Nível 3","Nível 3","1.14.9.","SINAPI",null,"10. MURO","-",null,null,null,null,""]
["S",3,"S",0,1,14,9,0,0,0,0,"F","Serviço","Serviço","1.14.9.0.1.","AGETOP",200101,"CHAPISCO COMUM","m2    ",1414.62,null,null,null,""]
["S",3,"S",0,1,14,9,0,0,0,0,"F","Serviço","Serviço","1.14.9.0.2.","AGETOP",200500,"REBOCO PAULISTA A-7 (1 CALH,4 ARMLC)","m2    ",1414.62,null,null,null,""]
[2,2,2,4,1,15,0,0,0,95,4,"F","Nível 2","Nível 2","1.15.",null,null,"FORROS","-",null,null,null,null,""]
[3,3,3,3,1,15,1,0,0,3,6,"F","Nível 3","Nível 3","1.15.1.","SINAPI",null,"4. COZINHA","-",null,null,null,null,""]
["S",3,"S",0,1,15,1,0,0,0,0,"F","Serviço","Serviço","1.15.1.0.1.","AGETOP",210498,"FORRO DE GESSO ACARTONADO PARA ÁREAS SECAS ESPESSURA DE 12,5MM","m2    ",146.06,null,null,null,""]
["S",3,"S",0,1,15,1,0,0,0,0,"F","Serviço","Serviço","1.15.1.0.2.","AGETOP",210506,"TABICA PARA FORRO DE GESSO COMUM","m     ",144.01,null,null,null,""]
[2,2,2,23,1,16,0,0,0,91,23,"F","Nível 2","Nível 2","1.16.",null,null,"REVESTIMENTO DE PISO","-",null,null,null,null,""]
[3,3,3,2,1,16,1,0,0,22,2,"F","Nível 3","Nível 3","1.16.1.","SINAPI",null,"1.3 QUADRA DESCOBERTA","-",null,null,null,null,""]
["S",3,"S",0,1,16,1,0,0,0,0,"F","Serviço","Serviço","1.16.1.0.1.","AGETOP",220102,"PISO CONCRETO DESEMPENADO ESPESSURA = 5 CM  1:2,5:3,5","m2    ",154.75,null,null,null,""]
[3,3,3,2,1,16,2,0,0,20,2,"F","Nível 3","Nível 3","1.16.2.","SINAPI",null,"2. RAMPA E ESCADA","-",null,null,null,null,""]
["S",3,"S",0,1,16,2,0,0,0,0,"F","Serviço","Serviço","1.16.2.0.1.","AGETOP",220102,"PISO CONCRETO DESEMPENADO ESPESSURA = 5 CM  1:2,5:3,5","m2    ",18,null,null,null,""]
[3,3,3,2,1,16,3,0,0,{"$f":"IF(OR($C531=\"S\",$C531=0),0,MATCH(0,OFFSET($D531,1,$C531,ROW($C$928)-ROW($C531)),0))","v":18},{"$f":"IF(OR($C531=\"S\",$C531=0),0,MATCH(OFFSET($D531,0,$C531)+1,OFFSET($D531,1,$C531,ROW($C$928)-ROW($C531)),0))","v":2},"F","Nível 3","Nível 3","1.16.3.","SINAPI",null,"3. VESTIÁRIOS FEMININO E MASCULINO","-",null,null,null,null,""]
["S",3,"S",0,1,16,3,0,0,0,0,"F","Serviço","Serviço","1.16.3.0.1.","AGETOP",220309,"PISO EM CERÂMICA PEI MAIOR OU IGUAL A 4 COM CONTRA PISO (1CI:3ARML) E ARGAMASSA COLANTE","m2    ",67.98,null,null,null,""]
[3,3,3,4,1,16,4,0,0,16,4,"F","Nível 3","Nível 3","1.16.4.","SINAPI",null,"4. COZINHA","-",null,null,null,null,""]
["S",3,"S",0,1,16,4,0,0,0,0,"F","Serviço","Serviço","1.16.4.0.1.","AGETOP",221101,"GRANITINA 8MM FUNDIDA COM CONTRAPISO (1CI:3ARML) E=2CM E JUNTA PLASTICA 27MM","m2    ",129,null,null,null,""]
["S",3,"S",0,1,16,4,0,0,0,0,"F","Serviço","Serviço","1.16.4.0.2.","AGETOP",221102,"RODAPÉ FUNDIDO DE GRANITINA 7CM","m     ",21.57,null,null,null,""]
["S",3,"S",0,1,16,4,0,0,0,0,"F","Serviço","Serviço","1.16.4.0.3.","AGETOP",221104,"RASPAGEM E APLICAÇÃO RESINA ACRÍLICA DUAS DEMÃOS","m2    ",130.50989999999999,null,null,null,""]
[3,3,3,2,1,16,5,0,0,12,2,"F","Nível 3","Nível 3","1.16.5.","SINAPI",null,"5. RAMPA","-",null,null,null,null,""]
["S",3,"S",0,1,16,5,0,0,0,0,"F","Serviço","Serviço","1.16.5.0.1.","AGETOP",220102,"PISO CONCRETO DESEMPENADO ESPESSURA = 5 CM  1:2,5:3,5","m2    ",15.5,null,null,null,""]
[3,3,3,2,1,16,6,0,0,10,2,"F","Nível 3","Nível 3","1.16.6.","SINAPI",null,"6. SANITÁRIOS FEMININO E MASCULINO","-",null,null,null,null,""]
["S",3,"S",0,1,16,6,0,0,0,0,"F","Serviço","Serviço","1.16.6.0.1.","AGETOP",220309,"PISO EM CERÂMICA PEI MAIOR OU IGUAL A 4 COM CONTRA PISO (1CI:3ARML) E ARGAMASSA COLANTE","m2    ",68.400000000000006,null,null,null,""]
[3,3,3,4,1,16,7,0,0,8,4,"F","Nível 3","Nível 3","1.16.7.","SINAPI",null,"7. PISO TÁTIL","-",null,null,null,null,""]
["S",3,"S",0,1,16,7,0,0,0,0,"F","Serviço","Serviço","1.16.7.0.1.","AGETOP",271803,"LADRILHO HIDRAULICO DE DUAS CORES (SEM LASTRO)","m2    ",80.679999999999993,null,null,null,""]
["S",3,"S",0,1,16,7,0,0,0,0,"F","Serviço","Serviço","1.16.7.0.2.","AGETOP",221120,"PISO DE BORRACHA COLORIDO MODELO TÁTIL ( ALERTA OU DIRECIONAL) INCLUSO CONTRAPISO (1CI:3ARML) C/ E=2CM E NATA DE CIMENTO","m2    ",1.5,null,null,null,""]
["S",3,"S",0,1,16,7,0,0,0,0,"F","Serviço","Serviço","1.16.7.0.3.","AGETOP",220102,"PISO CONCRETO DESEMPENADO ESPESSURA = 5 CM  1:2,5:3,5","m2    ",11.55,null,null,null,""]
[3,3,3,2,1,16,8,0,0,4,2,"F","Nível 3","Nível 3","1.16.8.","SINAPI",null,"8. CENTRAL DE GÁS","-",null,null,null,null,""]
["S",3,"S",0,1,16,8,0,0,0,0,"F","Serviço","Serviço","1.16.8.0.1.","AGETOP",220102,"PISO CONCRETO DESEMPENADO ESPESSURA = 5 CM  1:2,5:3,5","m2    ",1.2,null,null,null,""]
[3,3,3,2,1,16,9,0,0,2,{"$error":"#N/A"},"F","Nível 3","Nível 3","1.16.9.","SINAPI",null,"11. PREVENÇÃO E COMBATE A INCÊNDIO","-",null,null,null,null,""]
["S",3,"S",0,1,16,9,0,0,0,0,"F","Serviço","Serviço","1.16.9.0.1.","AGETOP",220102,"PISO CONCRETO DESEMPENADO ESPESSURA = 5 CM  1:2,5:3,5","m2    ",47.58,null,null,null,""]
[2,2,2,7,1,17,0,0,0,68,7,"F","Nível 2","Nível 2","1.17.",null,null,"FERRAGENS","-",null,null,null,null,""]
[3,3,3,3,1,17,1,0,0,6,3,"F","Nível 3","Nível 3","1.17.1.","SINAPI",91304,"3. VESTIÁRIOS FEMININO E MASCULINO","UN",null,null,null,null,""]
["S",3,"S",0,1,17,1,0,0,0,0,"F","Serviço","Serviço","1.17.1.0.1.","AGETOP",230174,"BARRA DE APOIO EM AÇO INOX - 40 CM","un    ",3,null,null,null,""]
["S",3,"S",0,1,17,1,0,0,0,0,"F","Serviço","Serviço","1.17.1.0.2.","AGETOP",230176,"BARRA DE APOIO EM AÇO INOX - 80 CM ","un    ",5,null,null,null,""]
[3,3,3,3,1,17,2,0,0,3,15,"F","Nível 3","Nível 3","1.17.2.","SINAPI",null,"6. SANITÁRIOS FEMININO E MASCULINO","-",null,null,null,null,""]
["S",3,"S",0,1,17,2,0,0,0,0,"F","Serviço","Serviço","1.17.2.0.1.","AGETOP",230174,"BARRA DE APOIO EM AÇO INOX - 40 CM","un    ",6,null,null,null,""]
["S",3,"S",0,1,17,2,0,0,0,0,"F","Serviço","Serviço","1.17.2.0.2.","AGETOP",230176,"BARRA DE APOIO EM AÇO INOX - 80 CM ","un    ",6,null,null,null,""]
[2,2,2,6,1,18,0,0,0,61,6,"F","Nível 2","Nível 2","1.18.",null,null,"ADMINISTRAÇÃO","-",null,null,null,null,""]
[3,3,3,3,1,18,1,0,0,5,3,"F","Nível 3","Nível 3","1.18.1.",null,null,"MENSALISTAS","-",null,null,null,null,""]
["S",3,"S",0,1,18,1,0,0,0,0,"F","Serviço","Serviço","1.18.1.0.1.","SINAPI",90778,"ENGENHEIRO CIVIL DE OBRA PLENO COM ENCARGOS COMPLEMENTARES","H",176,null,null,null,"Referência: AGETOP - 250101"]
["S",3,"S",0,1,18,1,0,0,0,0,"F","Serviço","Serviço","1.18.1.0.2.","SINAPI",90776,"ENCARREGADO GERAL COM ENCARGOS COMPLEMENTARES","H",880,null,null,null,"Referência: AGETOP - 250103"]
[3,3,3,2,1,18,2,0,0,2,8,"F","Nível 3","Nível 3","1.18.2.",null,null,"LAUDO DE ESTANQUEIDADE","-",null,null,null,null,""]
["S",3,"S",0,1,18,2,0,0,0,0,"F","Serviço","Serviço","1.18.2.0.1.","SINAPI",90778,"ENGENHEIRO CIVIL DE OBRA PLENO COM ENCARGOS COMPLEMENTARES","H",16,null,null,null,"Referência: AGETOP - 250101"]
[2,2,2,39,1,19,0,0,0,55,39,"F","Nível 2","Nível 2","1.19.",null,null,"PINTURA","-",null,null,null,null,""]
[3,3,3,3,1,19,1,0,0,38,3,"F","Nível 3","Nível 3","1.19.1.","SINAPI",null,"1. REFORMA E AMPLIAÇÃO","-",null,null,null,null,""]
["S",3,"S",0,1,19,1,0,0,0,0,"F","Serviço","Serviço","1.19.1.0.1.","AGETOP",261602,"PINT.ESMALTE/ESQUAD.FERRO C/FUNDO ANTICOR.","m2    ",7.2,null,null,null,""]
["S",3,"S",0,1,19,1,0,0,0,0,"F","Serviço","Serviço","1.19.1.0.2.","AGETOP",261000,"PINTURA LATEX ACRILICA 2 DEMAOS C/SELADOR","m2    ",32.5,null,null,null,""]
[3,3,3,2,1,19,2,0,0,35,2,"F","Nível 3","Nível 3","1.19.2.","SINAPI",null,"1.3 QUADRA DESCOBERTA","-",null,null,null,null,""]
["S",3,"S",0,1,19,2,0,0,0,0,"F","Serviço","Serviço","1.19.2.0.1.","AGETOP",261602,"PINT.ESMALTE/ESQUAD.FERRO C/FUNDO ANTICOR.","m2    ",18,null,null,null,""]
[3,3,3,8,1,19,3,0,0,33,8,"F","Nível 3","Nível 3","1.19.3.","SINAPI",null,"3. VESTIÁRIOS FEMININO E MASCULINO","-",null,null,null,null,""]
[{"$f":"CHOOSE(1+LOG(1+2*(ORÇAMENTO.Nivel=\"Nível 1\")+4*(ORÇAMENTO.Nivel=\"Nível 2\")+8*(ORÇAMENTO.Nivel=\"Nível 3\")+16*(ORÇAMENTO.Nivel=\"Nível 4\")+32*(ORÇAMENTO.Nivel=\"Serviço\"),2),0,1,2,3,4,\"S\")","v":"S"},{"$f":"IF(OR(C569=\"s\",C569=0),OFFSET(B569,-1,0),C569)","v":3},{"$f":"IF(OFFSET(C569,-1,0)=\"L\",1,IF(OFFSET(C569,-1,0)=1,2,IF(OR(A569=\"s\",A569=0),\"S\",IF(AND(OFFSET(C569,-1,0)=2,A569=4),3,IF(AND(OR(OFFSET(C569,-1,0)=\"s\",OFFSET(C569,-1,0)=0),A569<>\"s\",A569>OFFSET(B569,-1,0)),OFFSET(B569,-1,0),A569)))))","v":"S"},{"$f":"IF(OR(C569=\"S\",C569=0),0,IF(ISERROR(K569),J569,SMALL(J569:K569,1)))","v":0},{"$f":"IF($C569=1,OFFSET(E569,-1,0)+1,OFFSET(E569,-1,0))","v":1},{"$f":"IF($C569=1,0,IF($C569=2,OFFSET(F569,-1,0)+1,OFFSET(F569,-1,0)))","v":19},{"$f":"IF(AND($C569<=2,$C569<>0),0,IF($C569=3,OFFSET(G569,-1,0)+1,OFFSET(G569,-1,0)))","v":3},{"$f":"IF(AND($C569<=3,$C569<>0),0,IF($C569=4,OFFSET(H569,-1,0)+1,OFFSET(H569,-1,0)))","v":0},{"$f":"IF(AND($C569<=4,$C569<>0),0,IF(AND($C569=\"S\",$W569>0),OFFSET(I569,-1,0)+1,OFFSET(I569,-1,0)))","v":0},0,0,"F","Serviço","Serviço","1.19.3.0.1.","AGETOP",261300,"EMASSAMENTO COM MASSA PVA DUAS DEMAOS","m2    ",68.66,null,null,null,""]
["S",3,"S",0,1,19,3,0,0,0,0,"F","Serviço","Serviço","1.19.3.0.2.","AGETOP",261307,"PINTURA PVA LATEX 2 DEMAOS SEM SELADOR","m2    ",68.66,null,null,null,""]
["S",3,"S",0,1,19,3,0,0,0,0,"F","Serviço","Serviço","1.19.3.0.3.","AGETOP",260104,"REMOCAO DE PINTURA ANTIGA A LATEX","m2    ",20,null,null,null,""]
["S",3,"S",0,1,19,3,0,0,0,0,"F","Serviço","Serviço","1.19.3.0.4.","AGETOP",261602,"PINT.ESMALTE/ESQUAD.FERRO C/FUNDO ANTICOR.","m2    ",84.22,null,null,null,""]
["S",3,"S",0,1,19,3,0,0,0,0,"F","Serviço","Serviço","1.19.3.0.5.","AGETOP",260902,"PINTURA C/VERNIZ ACRILICO-02 DEMAOS","m2    ",120.07,null,null,null,""]
["S",3,"S",0,1,19,3,0,0,0,0,"F","Serviço","Serviço","1.19.3.0.6.","AGETOP",260105,"REMOCAO DE PINTURA ANTIGA A OLEO OU ESMALTE","m2    ",28.42,null,null,null,""]
["S",3,"S",0,1,19,3,0,0,0,0,"F","Serviço","Serviço","1.19.3.0.7.","AGETOP",261000,"PINTURA LATEX ACRILICA 2 DEMAOS C/SELADOR","m2    ",29.31,null,null,null,""]
[3,3,3,8,1,19,4,0,0,25,8,"F","Nível 3","Nível 3","1.19.4.","SINAPI",null,"4. COZINHA","-",null,null,null,null,""]
["S",3,"S",0,1,19,4,0,0,0,0,"F","Serviço","Serviço","1.19.4.0.1.","AGETOP",261300,"EMASSAMENTO COM MASSA PVA DUAS DEMAOS","m2    ",129,null,null,null,""]
["S",3,"S",0,1,19,4,0,0,0,0,"F","Serviço","Serviço","1.19.4.0.2.","AGETOP",260104,"REMOCAO DE PINTURA ANTIGA A LATEX","m2    ",21.08,null,null,null,""]
["S",3,"S",0,1,19,4,0,0,0,0,"F","Serviço","Serviço","1.19.4.0.3.","AGETOP",261550,"PINT.ESMALTE SINT.PAREDES - 2 DEM.C/SELADOR","m2    ",235.07999999999998,null,null,null,""]
["S",3,"S",0,1,19,4,0,0,0,0,"F","Serviço","Serviço","1.19.4.0.4.","AGETOP",261000,"PINTURA LATEX ACRILICA 2 DEMAOS C/SELADOR","m2    ",260.10000000000002,null,null,null,""]
["S",3,"S",0,1,19,4,0,0,0,0,"F","Serviço","Serviço","1.19.4.0.5.","AGETOP",261307,"PINTURA PVA LATEX 2 DEMAOS SEM SELADOR","m2    ",129,null,null,null,""]
["S",3,"S",0,1,19,4,0,0,0,0,"F","Serviço","Serviço","1.19.4.0.6.","AGETOP",261602,"PINT.ESMALTE/ESQUAD.FERRO C/FUNDO ANTICOR.","m2    ",105.42,null,null,null,""]
["S",3,"S",0,1,19,4,0,0,0,0,"F","Serviço","Serviço","1.19.4.0.7.","AGETOP",261503,"PINT.ESMALTE 2 DEM. ESQ.FERRO (SEM FUNDO ANTICOR.)","m2    ",21.08,null,null,null,""]
[3,3,3,6,1,19,5,0,0,17,6,"F","Nível 3","Nível 3","1.19.5.","SINAPI",null,"6. SANITÁRIOS FEMININO E MASCULINO","-",null,null,null,null,""]
["S",3,"S",0,1,19,5,0,0,0,0,"F","Serviço","Serviço","1.19.5.0.1.","AGETOP",260902,"PINTURA C/VERNIZ ACRILICO-02 DEMAOS","m2    ",16.53,null,null,null,""]
["S",3,"S",0,1,19,5,0,0,0,0,"F","Serviço","Serviço","1.19.5.0.2.","AGETOP",261307,"PINTURA PVA LATEX 2 DEMAOS SEM SELADOR","m2    ",68.400000000000006,null,null,null,""]
["S",3,"S",0,1,19,5,0,0,0,0,"F","Serviço","Serviço","1.19.5.0.3.","AGETOP",261602,"PINT.ESMALTE/ESQUAD.FERRO C/FUNDO ANTICOR.","m2    ",26.04,null,null,null,""]
["S",3,"S",0,1,19,5,0,0,0,0,"F","Serviço","Serviço","1.19.5.0.4.","AGETOP",260104,"REMOCAO DE PINTURA ANTIGA A LATEX","m2    ",20,null,null,null,""]
[{"$f":"CHOOSE(1+LOG(1+2*(ORÇAMENTO.Nivel=\"Nível 1\")+4*(ORÇAMENTO.Nivel=\"Nível 2\")+8*(ORÇAMENTO.Nivel=\"Nível 3\")+16*(ORÇAMENTO.Nivel=\"Nível 4\")+32*(ORÇAMENTO.Nivel=\"Serviço\"),2),0,1,2,3,4,\"S\")","v":"S"},{"$f":"IF(OR(C589=\"s\",C589=0),OFFSET(B589,-1,0),C589)","v":3},{"$f":"IF(OFFSET(C589,-1,0)=\"L\",1,IF(OFFSET(C589,-1,0)=1,2,IF(OR(A589=\"s\",A589=0),\"S\",IF(AND(OFFSET(C589,-1,0)=2,A589=4),3,IF(AND(OR(OFFSET(C589,-1,0)=\"s\",OFFSET(C589,-1,0)=0),A589<>\"s\",A589>OFFSET(B589,-1,0)),OFFSET(B589,-1,0),A589)))))","v":"S"},{"$f":"IF(OR(C589=\"S\",C589=0),0,IF(ISERROR(K589),J589,SMALL(J589:K589,1)))","v":0},{"$f":"IF($C589=1,OFFSET(E589,-1,0)+1,OFFSET(E589,-1,0))","v":1},{"$f":"IF($C589=1,0,IF($C589=2,OFFSET(F589,-1,0)+1,OFFSET(F589,-1,0)))","v":19},{"$f":"IF(AND($C589<=2,$C589<>0),0,IF($C589=3,OFFSET(G589,-1,0)+1,OFFSET(G589,-1,0)))","v":5},{"$f":"IF(AND($C589<=3,$C589<>0),0,IF($C589=4,OFFSET(H589,-1,0)+1,OFFSET(H589,-1,0)))","v":0},{"$f":"IF(AND($C589<=4,$C589<>0),0,IF(AND($C589=\"S\",$W589>0),OFFSET(I589,-1,0)+1,OFFSET(I589,-1,0)))","v":0},0,0,"F","Serviço","Serviço","1.19.5.0.5.","AGETOP",260105,"REMOCAO DE PINTURA ANTIGA A OLEO OU ESMALTE","m2    ",15.78,null,null,null,""]
[3,3,3,8,1,19,6,0,0,11,8,"F","Nível 3","Nível 3","1.19.6.","SINAPI",null,"9. PINTURA TODOS BLOCOS","-",null,null,null,null,""]
["S",3,"S",0,1,19,6,0,0,0,0,"F","Serviço","Serviço","1.19.6.0.1.","AGETOP",260902,"PINTURA C/VERNIZ ACRILICO-02 DEMAOS","m2    ",2199.4,null,null,null,""]
["S",3,"S",0,1,19,6,0,0,0,0,"F","Serviço","Serviço","1.19.6.0.2.","AGETOP",261000,"PINTURA LATEX ACRILICA 2 DEMAOS C/SELADOR","m2    ",495,null,null,null,""]
["S",3,"S",0,1,19,6,0,0,0,0,"F","Serviço","Serviço","1.19.6.0.3.","AGETOP",261304,"EMASSAMENTO ACRILICO 2 DEMAOS","m2    ",640.46,null,null,null,""]
["S",3,"S",0,1,19,6,0,0,0,0,"F","Serviço","Serviço","1.19.6.0.4.","AGETOP",260104,"REMOCAO DE PINTURA ANTIGA A LATEX","m2    ",640.46,null,null,null,""]
["S",3,"S",0,1,19,6,0,0,{"$f":"IF(OR($C595=\"S\",$C595=0),0,MATCH(0,OFFSET($D595,1,$C595,ROW($C$928)-ROW($C595)),0))","v":0},{"$f":"IF(OR($C595=\"S\",$C595=0),0,MATCH(OFFSET($D595,0,$C595)+1,OFFSET($D595,1,$C595,ROW($C$928)-ROW($C595)),0))","v":0},"F","Serviço","Serviço","1.19.6.0.5.","AGETOP",261307,"PINTURA PVA LATEX 2 DEMAOS SEM SELADOR","m2    ",1604.61,null,null,null,""]
[{"$f":"CHOOSE(1+LOG(1+2*(ORÇAMENTO.Nivel=\"Nível 1\")+4*(ORÇAMENTO.Nivel=\"Nível 2\")+8*(ORÇAMENTO.Nivel=\"Nível 3\")+16*(ORÇAMENTO.Nivel=\"Nível 4\")+32*(ORÇAMENTO.Nivel=\"Serviço\"),2),0,1,2,3,4,\"S\")","v":"S"},{"$f":"IF(OR(C596=\"s\",C596=0),OFFSET(B596,-1,0),C596)","v":3},{"$f":"IF(OFFSET(C596,-1,0)=\"L\",1,IF(OFFSET(C596,-1,0)=1,2,IF(OR(A596=\"s\",A596=0),\"S\",IF(AND(OFFSET(C596,-1,0)=2,A596=4),3,IF(AND(OR(OFFSET(C596,-1,0)=\"s\",OFFSET(C596,-1,0)=0),A596<>\"s\",A596>OFFSET(B596,-1,0)),OFFSET(B596,-1,0),A596)))))","v":"S"},{"$f":"IF(OR(C596=\"S\",C596=0),0,IF(ISERROR(K596),J596,SMALL(J596:K596,1)))","v":0},{"$f":"IF($C596=1,OFFSET(E596,-1,0)+1,OFFSET(E596,-1,0))","v":1},{"$f":"IF($C596=1,0,IF($C596=2,OFFSET(F596,-1,0)+1,OFFSET(F596,-1,0)))","v":19},{"$f":"IF(AND($C596<=2,$C596<>0),0,IF($C596=3,OFFSET(G596,-1,0)+1,OFFSET(G596,-1,0)))","v":6},{"$f":"IF(AND($C596<=3,$C596<>0),0,IF($C596=4,OFFSET(H596,-1,0)+1,OFFSET(H596,-1,0)))","v":0},{"$f":"IF(AND($C596<=4,$C596<>0),0,IF(AND($C596=\"S\",$W596>0),OFFSET(I596,-1,0)+1,OFFSET(I596,-1,0)))","v":0},0,0,"F","Serviço","Serviço","1.19.6.0.6.","AGETOP",260105,"REMOCAO DE PINTURA ANTIGA A OLEO OU ESMALTE","m2    ",739.04,null,null,null,""]
["S",3,"S",0,1,19,6,0,0,0,0,"F","Serviço","Serviço","1.19.6.0.7.","AGETOP",261602,"PINT.ESMALTE/ESQUAD.FERRO C/FUNDO ANTICOR.","m2    ",739.04,null,null,null,""]
[3,3,3,3,1,19,7,0,0,3,{"$error":"#N/A"},"F","Nível 3","Nível 3","1.19.7.","SINAPI",null,"10. MURO","-",null,null,null,null,""]
["S",3,"S",0,1,19,7,0,0,0,0,"F","Serviço","Serviço","1.19.7.0.1.","AGETOP",261000,"PINTURA LATEX ACRILICA 2 DEMAOS C/SELADOR","m2    ",1646,null,null,null,""]
["S",3,"S",0,1,19,7,0,0,0,0,"F","Serviço","Serviço","1.19.7.0.2.","AGETOP",261620,"LETREIRO MÉDIO A GRANDE PORTE EM PAREDE FEITO A PINCEL","m2    ",7.2,null,null,null,""]
[2,2,2,16,1,20,0,0,0,{"$f":"IF(OR($C601=\"S\",$C601=0),0,MATCH(0,OFFSET($D601,1,$C601,ROW($C$928)-ROW($C601)),0))","v":16},{"$f":"IF(OR($C601=\"S\",$C601=0),0,MATCH(OFFSET($D601,0,$C601)+1,OFFSET($D601,1,$C601,ROW($C$928)-ROW($C601)),0))","v":{"$error":"#N/A"}},"F","Nível 2","Nível 2","1.20.",null,null,"DIVERSOS","-",null,null,null,null,""]
[3,3,3,2,1,20,1,0,0,15,2,"F","Nível 3","Nível 3","1.20.1.","SINAPI",null,"1. REFORMA E AMPLIAÇÃO","-",null,null,null,null,""]
[{"$f":"CHOOSE(1+LOG(1+2*(ORÇAMENTO.Nivel=\"Nível 1\")+4*(ORÇAMENTO.Nivel=\"Nível 2\")+8*(ORÇAMENTO.Nivel=\"Nível 3\")+16*(ORÇAMENTO.Nivel=\"Nível 4\")+32*(ORÇAMENTO.Nivel=\"Serviço\"),2),0,1,2,3,4,\"S\")","v":"S"},3,"S",0,1,20,1,0,0,0,0,"F","Serviço","Serviço","1.20.1.0.1.","AGETOP",270312,"MURO DE ALVENARIA TIJOLO FURADO 1/2 VEZ ( H=2,50M) COM FUNDAÇÃO - SEM REVESTIMENTOS (PADRÃO GOINFRA)","m2    ",16.25,null,null,null,""]
[3,3,3,3,1,20,2,0,0,13,3,"F","Nível 3","Nível 3","1.20.2.","AGETOP",270501,"1.2 AMPLIAÇÃO SALAS ADAPTADAS","m2    ",null,null,null,null,""]
["S",3,"S",0,1,20,2,0,0,0,0,"F","Serviço","Serviço","1.20.2.0.1.","AGETOP",271608,"BANCADA DE GRANITO C/ESPELHO","m2    ",40.6,null,null,null,""]
["S",3,"S",0,1,20,2,0,0,0,0,"F","Serviço","Serviço","1.20.2.0.2.","AGETOP",270210,"PLANTIO GRAMA ESMERALDA PLACA C/ M.O. IRRIG., ADUBO,TERRA VEGETAL (O.C.) A<11.000,00M2","m2    ",28.13,null,null,null,""]
[3,3,3,2,1,20,3,0,0,10,2,"F","Nível 3","Nível 3","1.20.3.","SINAPI",null,"1.3 QUADRA DESCOBERTA","-",null,null,null,null,""]
["S",3,"S",0,1,20,3,0,0,0,0,"F","Serviço","Serviço","1.20.3.0.1.","AGETOP",270210,"PLANTIO GRAMA ESMERALDA PLACA C/ M.O. IRRIG., ADUBO,TERRA VEGETAL (O.C.) A<11.000,00M2","m2    ",74.06,null,null,null,""]
[3,3,3,3,1,20,4,0,0,8,3,"F","Nível 3","Nível 3","1.20.4.","SINAPI",null,"3. VESTIÁRIOS FEMININO E MASCULINO","-",null,null,null,null,""]
["S",3,"S",0,1,20,4,0,0,0,0,"F","Serviço","Serviço","1.20.4.0.1.","AGETOP",271608,"BANCADA DE GRANITO C/ESPELHO","m2    ",3.78,null,null,null,""]
["S",3,"S",0,1,20,4,0,0,0,0,"F","Serviço","Serviço","1.20.4.0.2.","COMPOSIÇÃO","COMP 206_SEE","BANCO ARTICULADO PARA BANHO, EM ACO INOX POLIDO, 70* CM X 45* CM","UN ",1,null,null,null,""]
[3,3,3,3,1,20,5,0,0,5,3,"F","Nível 3","Nível 3","1.20.5.","AGETOP",270701,"4. COZINHA","m     ",null,null,null,null,""]
["S",3,"S",0,1,20,5,0,0,0,0,"F","Serviço","Serviço","1.20.5.0.1.","AGETOP",271608,"BANCADA DE GRANITO C/ESPELHO","m2    ",21.35,null,null,null,""]
["S",3,"S",0,1,20,5,0,0,0,0,"F","Serviço","Serviço","1.20.5.0.2.","COMPOSIÇÃO","COMP 027_SEE","TELA MOSQUITEIRA EM NYLON COM ESTRUTURA DE ALUMÍNIO, COM FORNECIMENTO DE MÃO DE OBRA E INSTALAÇÃO","M2",15,null,null,null,""]
[3,3,3,2,1,20,6,0,0,2,{"$error":"#N/A"},"F","Nível 3","Nível 3","1.20.6.","AGETOP",271101,"6. SANITÁRIOS FEMININO E MASCULINO","CJ    ",null,null,null,null,""]
["S",3,"S",0,1,20,6,0,0,0,0,"F","Serviço","Serviço","1.20.6.0.1.","AGETOP",271608,"BANCADA DE GRANITO C/ESPELHO","m2    ",3,null,null,null,""]
[1,1,1,36,2,0,0,0,0,311,36,"F","Nível 1","Nível 1","2.","SINAPI",null,"PASSARELA PADRÃO SÉC. XXI 2015 - MOD 01","-",null,null,null,null,""]
[2,2,2,2,2,1,0,0,0,35,2,"F","Nível 2","Nível 2","2.1.","SINAPI",null,"SERVIÇOS PRELIMINARES","-",null,null,null,null,""]
["S",2,"S",0,2,1,0,0,0,0,0,"F","Serviço","Serviço","2.1.0.0.1.","AGETOP",20701,"LOCAÇÃO DA OBRA, EXECUÇÃO DE GABARITO SEM REAPROVEITAMENTO, INCLUSO PINTURA (FACE INTERNA DO RIPÃO 15CM) E PIQUETE COM TESTEMUNHA","m2    ",10.08,null,null,null,""]
[2,2,2,3,2,2,0,0,0,33,3,"F","Nível 2","Nível 2","2.2.","AGETOP",null,"TRANSPORTES","-",null,null,null,null,""]
["S",2,"S",0,2,2,0,0,0,0,0,"F","Serviço","Serviço","2.2.0.0.1.","SINAPI",72900,"TRANSPORTE DE ENTULHO COM CAMINHAO BASCULANTE 6 M3, RODOVIA PAVIMENTADA, DMT 0,5 A 1,0 KM","M3",3,null,null,null,""]
["S",2,"S",0,2,2,0,0,0,0,0,"F","Serviço","Serviço","2.2.0.0.2.","SINAPI",72897,"CARGA MANUAL DE ENTULHO EM CAMINHAO BASCULANTE 6 M3","M3",3,null,null,null,""]
[2,2,2,9,2,3,0,0,0,30,9,"F","Nível 2","Nível 2","2.3.","AGETOP",null,"FUNDAÇÕES E SONDAGENS","-",null,null,null,null,""]
["S",2,"S",0,2,3,0,0,0,0,0,"F","Serviço","Serviço","2.3.0.0.1.","SINAPI",96534,"FABRICAÇÃO, MONTAGEM E DESMONTAGEM DE FÔRMA PARA BLOCO DE COROAMENTO, EM MADEIRA SERRADA, E=25 MM, 4 UTILIZAÇÕES. AF_06/2017","M2",5.28,null,null,null,"Referência: AGETOP - 51009"]
["S",2,"S",0,2,3,0,0,0,0,0,"F","Serviço","Serviço","2.3.0.0.2.","SINAPI",96523,"ESCAVAÇÃO MANUAL PARA BLOCO DE COROAMENTO OU SAPATA, COM PREVISÃO DE FÔRMA. AF_06/2017","M3",1.0289999999999999,null,null,null,"Referência: AGETOP - 50901"]
["S",2,"S",0,2,3,0,0,0,0,0,"F","Serviço","Serviço","2.3.0.0.3.","AGETOP",50902,"APILOAMENTO (BLOCOS/SAPATAS)","m2    ",1,null,null,null,""]
["S",2,"S",0,2,3,0,0,0,0,0,"F","Serviço","Serviço","2.3.0.0.4.","SINAPI",96995,"REATERRO MANUAL APILOADO COM SOQUETE. AF_10/2017","M3",0.44899999999999995,null,null,null,"Referência: AGETOP - 40902"]
["S",2,"S",0,2,3,0,0,0,0,0,"F","Serviço","Serviço","2.3.0.0.5.","SINAPI",94964,"CONCRETO FCK = 20MPA, TRAÇO 1:2,7:3 (CIMENTO/ AREIA MÉDIA/ BRITA 1)  - PREPARO MECÂNICO COM BETONEIRA 400 L. AF_07/2016","M3",0.57999999999999996,null,null,null,""]
["S",2,"S",0,2,3,0,0,0,0,0,"F","Serviço","Serviço","2.3.0.0.6.","SINAPI","74157/4","LANCAMENTO/APLICACAO MANUAL DE CONCRETO EM FUNDACOES","M3",0.57999999999999996,null,null,null,"Referência: AGETOP - 51026"]
["S",2,"S",0,2,3,0,0,0,0,0,"F","Serviço","Serviço","2.3.0.0.7.","SINAPI",96547,"ARMAÇÃO DE BLOCO, VIGA BALDRAME OU SAPATA UTILIZANDO AÇO CA-50 DE 12,5 MM - MONTAGEM. AF_06/2017","KG",13.18181818181818,null,null,null,""]
["S",2,"S",0,2,3,0,0,0,0,0,"F","Serviço","Serviço","2.3.0.0.8.","SINAPI",96543,"ARMAÇÃO DE BLOCO, VIGA BALDRAME E SAPATA UTILIZANDO AÇO CA-60 DE 5 MM - MONTAGEM. AF_06/2017","KG",8.7272727272727266,null,null,null,"Referência: AGETOP - 52014"]
[2,2,2,6,2,4,0,0,0,21,6,"F","Nível 2","Nível 2","2.4.","AGETOP",null,"ESTRUTURA","-",null,null,null,null,""]
["S",2,"S",0,2,4,0,0,0,0,0,"F","Serviço","Serviço","2.4.0.0.1.","SINAPI",92426,"MONTAGEM E DESMONTAGEM DE FÔRMA DE PILARES RETANGULARES E ESTRUTURAS SIMILARES COM ÁREA MÉDIA DAS SEÇÕES MENOR OU IGUAL A 0,25 M², PÉ-DIREITO SIMPLES, EM CHAPA DE MADEIRA COMPENSADA RESINADA, 8 UTILIZAÇÕES. AF_12/2015","M2",1.29,null,null,null,""]
["S",2,"S",0,2,4,0,0,0,0,0,"F","Serviço","Serviço","2.4.0.0.2.","SINAPI",94964,"CONCRETO FCK = 20MPA, TRAÇO 1:2,7:3 (CIMENTO/ AREIA MÉDIA/ BRITA 1)  - PREPARO MECÂNICO COM BETONEIRA 400 L. AF_07/2016","M3",0.11,null,null,null,""]
[{"$f":"CHOOSE(1+LOG(1+2*(ORÇAMENTO.Nivel=\"Nível 1\")+4*(ORÇAMENTO.Nivel=\"Nível 2\")+8*(ORÇAMENTO.Nivel=\"Nível 3\")+16*(ORÇAMENTO.Nivel=\"Nível 4\")+32*(ORÇAMENTO.Nivel=\"Serviço\"),2),0,1,2,3,4,\"S\")","v":"S"},{"$f":"IF(OR(C635=\"s\",C635=0),OFFSET(B635,-1,0),C635)","v":2},{"$f":"IF(OFFSET(C635,-1,0)=\"L\",1,IF(OFFSET(C635,-1,0)=1,2,IF(OR(A635=\"s\",A635=0),\"S\",IF(AND(OFFSET(C635,-1,0)=2,A635=4),3,IF(AND(OR(OFFSET(C635,-1,0)=\"s\",OFFSET(C635,-1,0)=0),A635<>\"s\",A635>OFFSET(B635,-1,0)),OFFSET(B635,-1,0),A635)))))","v":"S"},{"$f":"IF(OR(C635=\"S\",C635=0),0,IF(ISERROR(K635),J635,SMALL(J635:K635,1)))","v":0},{"$f":"IF($C635=1,OFFSET(E635,-1,0)+1,OFFSET(E635,-1,0))","v":2},{"$f":"IF($C635=1,0,IF($C635=2,OFFSET(F635,-1,0)+1,OFFSET(F635,-1,0)))","v":4},{"$f":"IF(AND($C635<=2,$C635<>0),0,IF($C635=3,OFFSET(G635,-1,0)+1,OFFSET(G635,-1,0)))","v":0},{"$f":"IF(AND($C635<=3,$C635<>0),0,IF($C635=4,OFFSET(H635,-1,0)+1,OFFSET(H635,-1,0)))","v":0},{"$f":"IF(AND($C635<=4,$C635<>0),0,IF(AND($C635=\"S\",$W635>0),OFFSET(I635,-1,0)+1,OFFSET(I635,-1,0)))","v":0},0,0,"F","Serviço","Serviço","2.4.0.0.3.","SINAPI",92873,"LANÇAMENTO COM USO DE BALDES, ADENSAMENTO E ACABAMENTO DE CONCRETO EM ESTRUTURAS. AF_12/2015","M3",0.11,null,null,null,"Referência: AGETOP - 60801"]
["S",2,"S",0,2,4,0,0,0,0,0,"F","Serviço","Serviço","2.4.0.0.4.","SINAPI",92779,"ARMAÇÃO DE PILAR OU VIGA DE UMA ESTRUTURA CONVENCIONAL DE CONCRETO ARMADO EM UMA EDIFICAÇÃO TÉRREA OU SOBRADO UTILIZANDO AÇO CA-50 DE 12,5 MM - MONTAGEM. AF_12/2015","KG",2.8181818181818179,null,null,null,""]
["S",2,"S",0,2,4,0,0,0,0,0,"F","Serviço","Serviço","2.4.0.0.5.","SINAPI",92775,"ARMAÇÃO DE PILAR OU VIGA DE UMA ESTRUTURA CONVENCIONAL DE CONCRETO ARMADO EM UMA EDIFICAÇÃO TÉRREA OU SOBRADO UTILIZANDO AÇO CA-60 DE 5,0 MM - MONTAGEM. AF_12/2015","KG",1.4545454545454546,null,null,null,"Referência: AGETOP - 60314"]
[2,2,2,2,2,5,0,0,0,15,2,"F","Nível 2","Nível 2","2.5.",null,null,"IMPERMEABILIZAÇÃO","-",null,null,null,null,""]
["S",2,"S",0,2,5,0,0,0,0,0,"F","Serviço","Serviço","2.5.0.0.1.","SINAPI",98562,"IMPERMEABILIZAÇÃO DE FLOREIRA OU VIGA BALDRAME COM ARGAMASSA DE CIMENTO E AREIA, COM ADITIVO IMPERMEABILIZANTE, E = 2 CM. AF_06/2018","M2",3.6,null,null,null,"Referência: AGETOP - 120902"]
[2,2,2,2,2,6,0,0,0,13,2,"F","Nível 2","Nível 2","2.6.",null,null,"ESTRUTURAS METÁLICAS","-",null,null,null,null,""]
["S",2,"S",0,2,6,0,0,0,0,0,"F","Serviço","Serviço","2.6.0.0.1.","AGETOP",150103,"ESTRUTURA METÁLICA CONVENCIONAL EM AÇO DO TIPO USI SAC-300 COM FUNDO ANTICORROSIVO","Kg    ",161.91200000000003,null,null,null,""]
[2,2,2,3,2,7,0,0,0,11,3,"F","Nível 2","Nível 2","2.7.",null,null,"COBERTURAS","-",null,null,null,null,""]
["S",2,"S",0,2,7,0,0,0,0,0,"F","Serviço","Serviço","2.7.0.0.1.","SINAPI",94213,"TELHAMENTO COM TELHA DE AÇO/ALUMÍNIO E = 0,5 MM, COM ATÉ 2 ÁGUAS, INCLUSO IÇAMENTO. AF_07/2019","M2",12.96,null,null,null,"Referência: AGETOP - 160905"]
["S",2,"S",0,2,7,0,0,0,0,0,"F","Serviço","Serviço","2.7.0.0.2.","SINAPI",94228,"CALHA EM CHAPA DE AÇO GALVANIZADO NÚMERO 24, DESENVOLVIMENTO DE 50 CM, INCLUSO TRANSPORTE VERTICAL. AF_07/2019","M",3.6,null,null,null,"Referência: AGETOP - 160601"]
[2,2,2,4,2,8,0,0,0,8,4,"F","Nível 2","Nível 2","2.8.",null,null,"REVESTIMENTO DE PISO","-",null,null,null,null,""]
["S",2,"S",0,2,8,0,0,0,0,0,"F","Serviço","Serviço","2.8.0.0.1.","SINAPI",95241,"LASTRO DE CONCRETO MAGRO, APLICADO EM PISOS OU RADIERS, ESPESSURA DE 5 CM. AF_07/2016","M2",10.08,null,null,null,""]
["S",2,"S",0,2,8,0,0,0,0,0,"F","Serviço","Serviço","2.8.0.0.2.","SINAPI",84191,"PISO EM GRANILITE, MARMORITE OU GRANITINA ESPESSURA 8 MM, INCLUSO JUNTAS DE DILATACAO PLASTICAS","M2",10.64,null,null,null,"Referência: AGETOP - 221101"]
["S",2,"S",0,2,8,0,0,0,0,0,"F","Serviço","Serviço","2.8.0.0.3.","AGETOP",221104,"RASPAGEM E APLICAÇÃO RESINA ACRÍLICA DUAS DEMÃOS","m2    ",10.64,null,null,null,""]
[2,2,2,2,2,9,0,0,0,4,2,"F","Nível 2","Nível 2","2.9.",null,null,"PINTURA","-",null,null,null,null,""]
["S",2,"S",0,2,9,0,0,0,0,0,"F","Serviço","Serviço","2.9.0.0.1.","SINAPI","74145/1","PINTURA ESMALTE FOSCO, DUAS DEMAOS, SOBRE SUPERFICIE METALICA, INCLUSO UMA DEMAO DE FUNDO ANTICORROSIVO. UTILIZACAO DE REVOLVER ( AR-COMPRIMIDO).","M2",25.92,null,null,null,"Referência: AGETOP - 261602"]
[2,2,2,2,2,10,0,0,0,2,114,"F","Nível 2","Nível 2","2.10.","SINAPI",null,"DIVERSOS","-",null,null,null,null,""]
["S",2,"S",0,2,10,0,0,0,0,0,"F","Serviço","Serviço","2.10.0.0.1.","AGETOP",270501,"LIMPEZA FINAL DE OBRA - (OBRAS CIVIS)","m2    ",10.08,null,null,null,""]
[1,1,1,146,3,0,0,0,0,275,146,"F","Nível 1","Nível 1","3.","SINAPI",null,"BLOCO 02 SALAS DE AULA PADRÃO SEDUC - 2017 - LAJE","-",null,null,null,null,""]
[2,2,2,2,3,1,0,0,0,145,2,"F","Nível 2","Nível 2","3.1.","AGETOP",null,"SERVIÇOS PRELIMINARES","-",null,null,null,null,""]
["S",2,"S",0,3,1,0,0,0,0,0,"F","Serviço","Serviço","3.1.0.0.1.","AGETOP",20701,"LOCAÇÃO DA OBRA, EXECUÇÃO DE GABARITO SEM REAPROVEITAMENTO, INCLUSO PINTURA (FACE INTERNA DO RIPÃO 15CM) E PIQUETE COM TESTEMUNHA","m2    ",127.26,null,null,null,""]
[2,2,2,3,3,2,0,0,0,143,3,"F","Nível 2","Nível 2","3.2.","SINAPI",null,"TRANSPORTES","-",null,null,null,null,""]
["S",2,"S",0,3,2,0,0,0,0,0,"F","Serviço","Serviço","3.2.0.0.1.","SINAPI",72897,"CARGA MANUAL DE ENTULHO EM CAMINHAO BASCULANTE 6 M3","M3",8.9,null,null,null,""]
["S",2,"S",0,3,2,0,0,0,0,0,"F","Serviço","Serviço","3.2.0.0.2.","SINAPI",72900,"TRANSPORTE DE ENTULHO COM CAMINHAO BASCULANTE 6 M3, RODOVIA PAVIMENTADA, DMT 0,5 A 1,0 KM","M3",8.9,null,null,null,""]
[2,2,2,7,3,3,0,0,0,140,7,"F","Nível 2","Nível 2","3.3.","SINAPI",null,"SERVIÇO EM TERRA","-",null,null,null,null,""]
[3,3,3,3,3,3,1,0,0,6,3,"F","Nível 3","Nível 3","3.3.1.","SINAPI",null,"SPDA","-",null,null,null,null,""]
["S",3,"S",0,3,3,1,0,0,0,0,"F","Serviço","Serviço","3.3.1.0.1.","SINAPI",93358,"ESCAVAÇÃO MANUAL DE VALA COM PROFUNDIDADE MENOR OU IGUAL A 1,30 M. AF_03/2016","M3",6.6,null,null,null,"Referência: AGETOP - 40101"]
["S",3,"S",0,3,3,1,0,0,0,0,"F","Serviço","Serviço","3.3.1.0.2.","AGETOP",40902,"REATERRO COM APILOAMENTO","m3    ",6.6,null,null,null,""]
[3,3,3,3,3,3,2,0,0,3,37,"F","Nível 3","Nível 3","3.3.2.","SINAPI",null,"OUTROS","-",null,null,null,null,""]
["S",3,"S",0,3,3,2,0,0,0,0,"F","Serviço","Serviço","3.3.2.0.1.","AGETOP",41140,"REGULARIZAÇÃO DO TERRENO SEM APILOAMENTO COM TRANSPORTE MANUAL DA TERRA ESCAVADA ","m2    ",127.26,null,null,null,""]
["S",3,"S",0,3,3,2,0,0,{"$f":"IF(OR($C665=\"S\",$C665=0),0,MATCH(0,OFFSET($D665,1,$C665,ROW($C$928)-ROW($C665)),0))","v":0},{"$f":"IF(OR($C665=\"S\",$C665=0),0,MATCH(OFFSET($D665,0,$C665)+1,OFFSET($D665,1,$C665,ROW($C$928)-ROW($C665)),0))","v":0},"F","Serviço","Serviço","3.3.2.0.2.","AGETOP",41002,"APILOAMENTO","m2    ",127.26,null,null,null,""]
[2,2,2,19,3,4,0,0,0,133,19,"F","Nível 2","Nível 2","3.4.","SINAPI",null,"FUNDAÇÕES E SONDAGENS","-",null,null,null,null,""]
[{"$f":"CHOOSE(1+LOG(1+2*(ORÇAMENTO.Nivel=\"Nível 1\")+4*(ORÇAMENTO.Nivel=\"Nível 2\")+8*(ORÇAMENTO.Nivel=\"Nível 3\")+16*(ORÇAMENTO.Nivel=\"Nível 4\")+32*(ORÇAMENTO.Nivel=\"Serviço\"),2),0,1,2,3,4,\"S\")","v":3},3,3,10,3,4,1,0,0,18,10,"F","Nível 3","Nível 3","3.4.1.","SINAPI",null,"ESTACAS E BLOCOS","-",null,null,null,null,""]
["S",3,"S",0,3,4,1,0,0,0,0,"F","Serviço","Serviço","3.4.1.0.1.","SINAPI",98230,"ESTACA BROCA DE CONCRETO, DIÂMETRO DE 30 CM, PROFUNDIDADE DE ATÉ 3 M, ESCAVAÇÃO MANUAL COM TRADO CONCHA, NÃO ARMADA. AF_03/2018","M",75.5,null,null,null,"Referência: AGETOP - 50302"]
["S",3,"S",0,3,4,1,0,0,0,0,"F","Serviço","Serviço","3.4.1.0.2.","SINAPI",96522,"ESCAVAÇÃO MANUAL PARA BLOCO DE COROAMENTO OU SAPATA, SEM PREVISÃO DE FÔRMA. AF_06/2017","M3",2.41,null,null,null,"Referência: AGETOP - 50901"]
["S",3,"S",0,3,4,1,0,0,0,0,"F","Serviço","Serviço","3.4.1.0.3.","SINAPI",96995,"REATERRO MANUAL APILOADO COM SOQUETE. AF_10/2017","M3",0.20999999999999996,null,null,null,"Referência: AGETOP - 40902"]
["S",3,"S",0,3,4,1,0,0,0,0,"F","Serviço","Serviço","3.4.1.0.4.","SINAPI",94963,"CONCRETO FCK = 15MPA, TRAÇO 1:3,4:3,5 (CIMENTO/ AREIA MÉDIA/ BRITA 1)  - PREPARO MECÂNICO COM BETONEIRA 400 L. AF_07/2016","M3",2.2000000000000002,null,null,null,""]
["S",3,"S",0,3,4,1,0,0,0,0,"F","Serviço","Serviço","3.4.1.0.5.","SINAPI","74157/4","LANCAMENTO/APLICACAO MANUAL DE CONCRETO EM FUNDACOES","M3",2.2000000000000002,null,null,null,"Referência: AGETOP - 51026"]
["S",3,"S",0,3,4,1,0,0,0,0,"F","Serviço","Serviço","3.4.1.0.6.","SINAPI",96544,"ARMAÇÃO DE BLOCO, VIGA BALDRAME OU SAPATA UTILIZANDO AÇO CA-50 DE 6,3 MM - MONTAGEM. AF_06/2017","KG",42.63,null,null,null,"Referência: AGETOP - 52003"]
["S",3,"S",0,3,4,1,0,0,0,0,"F","Serviço","Serviço","3.4.1.0.7.","SINAPI",96545,"ARMAÇÃO DE BLOCO, VIGA BALDRAME OU SAPATA UTILIZANDO AÇO CA-50 DE 8 MM - MONTAGEM. AF_06/2017","KG",96.7,null,null,null,"Referência: AGETOP - 52004"]
["S",3,"S",0,3,4,1,0,0,0,0,"F","Serviço","Serviço","3.4.1.0.8.","SINAPI",96546,"ARMAÇÃO DE BLOCO, VIGA BALDRAME OU SAPATA UTILIZANDO AÇO CA-50 DE 10 MM - MONTAGEM. AF_06/2017","KG",71.06,null,null,null,"Referência: AGETOP - 52005"]
["S",3,"S",0,3,4,1,0,0,0,0,"F","Serviço","Serviço","3.4.1.0.9.","SINAPI",96543,"ARMAÇÃO DE BLOCO, VIGA BALDRAME E SAPATA UTILIZANDO AÇO CA-60 DE 5 MM - MONTAGEM. AF_06/2017","KG",29.99,null,null,null,"Referência: AGETOP - 52014"]
[3,3,3,8,3,4,2,0,0,8,23,"F","Nível 3","Nível 3","3.4.2.","SINAPI",null,"VIGAS BALDRAMES","-",null,null,null,null,""]
["S",3,"S",0,3,4,2,0,0,0,0,"F","Serviço","Serviço","3.4.2.0.1.","SINAPI",96527,"ESCAVAÇÃO MANUAL DE VALA PARA VIGA BALDRAME, COM PREVISÃO DE FÔRMA. AF_06/2017","M3",0.6,null,null,null,"Referência: AGETOP - 40101"]
["S",3,"S",0,3,4,2,0,0,0,0,"F","Serviço","Serviço","3.4.2.0.2.","SINAPI",96995,"REATERRO MANUAL APILOADO COM SOQUETE. AF_10/2017","M3",2.4,null,null,null,"Referência: AGETOP - 40902"]
["S",3,"S",0,3,4,2,0,0,0,0,"F","Serviço","Serviço","3.4.2.0.3.","AGETOP",60191,"FORMA DE TABUA CINTA BALDRAME U=8 VEZES","m2    ",42.79,null,null,null,""]
["S",3,"S",0,3,4,2,0,0,0,0,"F","Serviço","Serviço","3.4.2.0.4.","SINAPI",94963,"CONCRETO FCK = 15MPA, TRAÇO 1:3,4:3,5 (CIMENTO/ AREIA MÉDIA/ BRITA 1)  - PREPARO MECÂNICO COM BETONEIRA 400 L. AF_07/2016","M3",3,null,null,null,""]
["S",3,"S",0,3,4,2,0,0,0,0,"F","Serviço","Serviço","3.4.2.0.5.","SINAPI","74157/4","LANCAMENTO/APLICACAO MANUAL DE CONCRETO EM FUNDACOES","M3",3,null,null,null,"Referência: AGETOP - 51026"]
["S",3,"S",0,3,4,2,0,0,0,0,"F","Serviço","Serviço","3.4.2.0.6.","SINAPI",96545,"ARMAÇÃO DE BLOCO, VIGA BALDRAME OU SAPATA UTILIZANDO AÇO CA-50 DE 8 MM - MONTAGEM. AF_06/2017","KG",123.12,null,null,null,"Referência: AGETOP - 52004"]
["S",3,"S",0,3,4,2,0,0,0,0,"F","Serviço","Serviço","3.4.2.0.7.","SINAPI",96543,"ARMAÇÃO DE BLOCO, VIGA BALDRAME E SAPATA UTILIZANDO AÇO CA-60 DE 5 MM - MONTAGEM. AF_06/2017","KG",66.91,null,null,null,"Referência: AGETOP - 52014"]
[2,2,2,17,3,5,0,0,0,114,17,"F","Nível 2","Nível 2","3.5.","SINAPI",null,"ESTRUTURA","-",null,null,null,null,""]
[3,3,3,6,3,5,1,0,0,16,6,"F","Nível 3","Nível 3","3.5.1.","SINAPI",null,"PILARES","-",null,null,null,null,""]
["S",3,"S",0,3,5,1,0,0,0,0,"F","Serviço","Serviço","3.5.1.0.1.","SINAPI",92426,"MONTAGEM E DESMONTAGEM DE FÔRMA DE PILARES RETANGULARES E ESTRUTURAS SIMILARES COM ÁREA MÉDIA DAS SEÇÕES MENOR OU IGUAL A 0,25 M², PÉ-DIREITO SIMPLES, EM CHAPA DE MADEIRA COMPENSADA RESINADA, 8 UTILIZAÇÕES. AF_12/2015","M2",27.1,null,null,null,""]
["S",3,"S",0,3,5,1,0,0,0,0,"F","Serviço","Serviço","3.5.1.0.2.","SINAPI",94964,"CONCRETO FCK = 20MPA, TRAÇO 1:2,7:3 (CIMENTO/ AREIA MÉDIA/ BRITA 1)  - PREPARO MECÂNICO COM BETONEIRA 400 L. AF_07/2016","M3",1.29,null,null,null,""]
["S",3,"S",0,3,5,1,0,0,0,0,"F","Serviço","Serviço","3.5.1.0.3.","SINAPI",92873,"LANÇAMENTO COM USO DE BALDES, ADENSAMENTO E ACABAMENTO DE CONCRETO EM ESTRUTURAS. AF_12/2015","M3",1.29,null,null,null,"Referência: AGETOP - 60801"]
["S",3,"S",0,3,5,1,0,0,0,0,"F","Serviço","Serviço","3.5.1.0.4.","SINAPI",92778,"ARMAÇÃO DE PILAR OU VIGA DE UMA ESTRUTURA CONVENCIONAL DE CONCRETO ARMADO EM UMA EDIFICAÇÃO TÉRREA OU SOBRADO UTILIZANDO AÇO CA-50 DE 10,0 MM - MONTAGEM. AF_12/2015","KG",77.62,null,null,null,"Referência: AGETOP - 60305"]
["S",3,"S",0,3,5,1,0,0,0,0,"F","Serviço","Serviço","3.5.1.0.5.","SINAPI",92775,"ARMAÇÃO DE PILAR OU VIGA DE UMA ESTRUTURA CONVENCIONAL DE CONCRETO ARMADO EM UMA EDIFICAÇÃO TÉRREA OU SOBRADO UTILIZANDO AÇO CA-60 DE 5,0 MM - MONTAGEM. AF_12/2015","KG",35.36,null,null,null,"Referência: AGETOP - 60314"]
[3,3,3,8,3,5,2,0,0,10,8,"F","Nível 3","Nível 3","3.5.2.","SINAPI",null,"VIGAS DE COBERTURA","-",null,null,null,null,""]
["S",3,"S",0,3,5,2,0,0,0,0,"F","Serviço","Serviço","3.5.2.0.1.","SINAPI",92464,"MONTAGEM E DESMONTAGEM DE FÔRMA DE VIGA, ESCORAMENTO METÁLICO, PÉ-DIREITO SIMPLES, EM CHAPA DE MADEIRA RESINADA, 8 UTILIZAÇÕES. AF_12/2015","M2",37.729999999999997,null,null,null,"Referência: AGETOP - 60209"]
["S",3,"S",0,3,5,2,0,0,0,0,"F","Serviço","Serviço","3.5.2.0.2.","SINAPI",94964,"CONCRETO FCK = 20MPA, TRAÇO 1:2,7:3 (CIMENTO/ AREIA MÉDIA/ BRITA 1)  - PREPARO MECÂNICO COM BETONEIRA 400 L. AF_07/2016","M3",2.14,null,null,null,""]
["S",3,"S",0,3,5,2,0,0,0,0,"F","Serviço","Serviço","3.5.2.0.3.","SINAPI",92873,"LANÇAMENTO COM USO DE BALDES, ADENSAMENTO E ACABAMENTO DE CONCRETO EM ESTRUTURAS. AF_12/2015","M3",2.14,null,null,null,"Referência: AGETOP - 60801"]
["S",3,"S",0,3,5,2,0,0,0,0,"F","Serviço","Serviço","3.5.2.0.4.","SINAPI",92777,"ARMAÇÃO DE PILAR OU VIGA DE UMA ESTRUTURA CONVENCIONAL DE CONCRETO ARMADO EM UMA EDIFICAÇÃO TÉRREA OU SOBRADO UTILIZANDO AÇO CA-50 DE 8,0 MM - MONTAGEM. AF_12/2015","KG",5.84,null,null,null,"Referência: AGETOP - 60304"]
["S",3,"S",0,3,5,2,0,0,0,0,"F","Serviço","Serviço","3.5.2.0.5.","SINAPI",92778,"ARMAÇÃO DE PILAR OU VIGA DE UMA ESTRUTURA CONVENCIONAL DE CONCRETO ARMADO EM UMA EDIFICAÇÃO TÉRREA OU SOBRADO UTILIZANDO AÇO CA-50 DE 10,0 MM - MONTAGEM. AF_12/2015","KG",26.59,null,null,null,"Referência: AGETOP - 60305"]
["S",3,"S",0,3,5,2,0,0,0,0,"F","Serviço","Serviço","3.5.2.0.6.","SINAPI",92779,"ARMAÇÃO DE PILAR OU VIGA DE UMA ESTRUTURA CONVENCIONAL DE CONCRETO ARMADO EM UMA EDIFICAÇÃO TÉRREA OU SOBRADO UTILIZANDO AÇO CA-50 DE 12,5 MM - MONTAGEM. AF_12/2015","KG",231.7,null,null,null,""]
["S",3,"S",0,3,5,2,0,0,0,0,"F","Serviço","Serviço","3.5.2.0.7.","SINAPI",92775,"ARMAÇÃO DE PILAR OU VIGA DE UMA ESTRUTURA CONVENCIONAL DE CONCRETO ARMADO EM UMA EDIFICAÇÃO TÉRREA OU SOBRADO UTILIZANDO AÇO CA-60 DE 5,0 MM - MONTAGEM. AF_12/2015","KG",56.29,null,null,null,"Referência: AGETOP - 60314"]
[3,3,3,2,3,5,3,0,0,2,155,"F","Nível 3","Nível 3","3.5.3.","SINAPI",null,"LAJE","-",null,null,null,null,""]
["S",3,"S",0,3,5,3,0,0,0,0,"F","Serviço","Serviço","3.5.3.0.1.","SINAPI","74202/1","LAJE PRE-MOLDADA P/FORRO, SOBRECARGA 100KG/M2, VAOS ATE 3,50M/E=8CM, C/LAJOTAS E CAP.C/CONC FCK=20MPA, 3CM, INTER-EIXO 38CM, C/ESCORAMENTO (REAPR.3X) E FERRAGEM NEGATIVA","M2",97.3,null,null,null,""]
[2,2,2,48,3,6,0,0,0,97,48,"F","Nível 2","Nível 2","3.6.","SINAPI",null,"INSTALAÇÕES ELÉTRICAS","-",null,null,null,null,""]
[3,3,3,32,3,6,1,0,0,47,32,"F","Nível 3","Nível 3","3.6.1.","SINAPI",null,"INST. ELÉTRICAS","-",null,null,null,null,""]
["S",3,"S",0,3,6,1,0,0,0,0,"F","Serviço","Serviço","3.6.1.0.1.","AGETOP",70351,"BRACADEIRA METALICA TIPO \"U\" DIAM. 3/4\"","Un    ",50,null,null,null,""]
["S",3,"S",0,3,6,1,0,0,0,0,"F","Serviço","Serviço","3.6.1.0.2.","AGETOP",70352,"BRACADEIRA METALICA TIPO \"U\" DIAM. 1\"","Un    ",10,null,null,null,""]
["S",3,"S",0,3,6,1,0,0,0,0,"F","Serviço","Serviço","3.6.1.0.3.","AGETOP",70421,"BUCHA E ARRUELA METALICA DIAM. 3/4\"","PR    ",2,null,null,null,""]
["S",3,"S",0,3,6,1,0,0,0,0,"F","Serviço","Serviço","3.6.1.0.4.","AGETOP",70422,"BUCHA E ARRUELA METALICA DIAM. 1\"","PR    ",2,null,null,null,""]
["S",3,"S",0,3,6,1,0,0,0,0,"F","Serviço","Serviço","3.6.1.0.5.","SINAPI",92980,"CABO DE COBRE FLEXÍVEL ISOLADO, 10 MM², ANTI-CHAMA 0,6/1,0 KV, PARA DISTRIBUIÇÃO - FORNECIMENTO E INSTALAÇÃO. AF_12/2015","M",1,null,null,null,""]
["S",3,"S",0,3,6,1,0,0,0,0,"F","Serviço","Serviço","3.6.1.0.6.","AGETOP",70561,"CABO ISOLADO PP 3 X 2,5 MM2","M     ",60,null,null,null,""]
["S",3,"S",0,3,6,1,0,0,0,0,"F","Serviço","Serviço","3.6.1.0.7.","SINAPI",91926,"CABO DE COBRE FLEXÍVEL ISOLADO, 2,5 MM², ANTI-CHAMA 450/750 V, PARA CIRCUITOS TERMINAIS - FORNECIMENTO E INSTALAÇÃO. AF_12/2015","M",230,null,null,null,"Referência: AGETOP - 70563"]
["S",3,"S",0,3,6,1,0,0,0,0,"F","Serviço","Serviço","3.6.1.0.8.","SINAPI",91928,"CABO DE COBRE FLEXÍVEL ISOLADO, 4 MM², ANTI-CHAMA 450/750 V, PARA CIRCUITOS TERMINAIS - FORNECIMENTO E INSTALAÇÃO. AF_12/2015","M",190,null,null,null,"Referência: AGETOP - 70564"]
["S",3,"S",0,3,6,1,0,0,0,0,"F","Serviço","Serviço","3.6.1.0.9.","SINAPI",91937,"CAIXA OCTOGONAL 3\" X 3\", PVC, INSTALADA EM LAJE - FORNECIMENTO E INSTALAÇÃO. AF_12/2015","UN",15,null,null,null,""]
["S",3,"S",0,3,6,1,0,0,0,0,"F","Serviço","Serviço","3.6.1.0.10.","SINAPI",92868,"CAIXA RETANGULAR 4\" X 2\" MÉDIA (1,30 M DO PISO), METÁLICA, INSTALADA EM PAREDE - FORNECIMENTO E INSTALAÇÃO. AF_12/2015","UN",12,null,null,null,"Referência: AGETOP - 70691"]
["S",3,"S",0,3,6,1,0,0,0,0,"F","Serviço","Serviço","3.6.1.0.11.","AGETOP",70924,"CONDULETE DE PVC - CAIXA COM 5 ENTRADAS ","un    ",10,null,null,null,""]
["S",3,"S",0,3,6,1,0,0,0,0,"F","Serviço","Serviço","3.6.1.0.12.","SINAPI",91902,"CURVA 90 GRAUS PARA ELETRODUTO, PVC, ROSCÁVEL, DN 25 MM (3/4\"), PARA CIRCUITOS TERMINAIS, INSTALADA EM LAJE - FORNECIMENTO E INSTALAÇÃO. AF_12/2015","UN",4,null,null,null,"Referência: AGETOP - 71141"]
["S",3,"S",0,3,6,1,0,0,0,0,"F","Serviço","Serviço","3.6.1.0.13.","SINAPI",91905,"CURVA 90 GRAUS PARA ELETRODUTO, PVC, ROSCÁVEL, DN 32 MM (1\"), PARA CIRCUITOS TERMINAIS, INSTALADA EM LAJE - FORNECIMENTO E INSTALAÇÃO. AF_12/2015","UN",4,null,null,null,"Referência: AGETOP - 71142"]
["S",3,"S",0,3,6,1,0,0,0,0,"F","Serviço","Serviço","3.6.1.0.14.","SINAPI",93653,"DISJUNTOR MONOPOLAR TIPO DIN, CORRENTE NOMINAL DE 10A - FORNECIMENTO E INSTALAÇÃO. AF_04/2016","UN",3,null,null,null,""]
["S",3,"S",0,3,6,1,0,0,0,0,"F","Serviço","Serviço","3.6.1.0.15.","SINAPI",93654,"DISJUNTOR MONOPOLAR TIPO DIN, CORRENTE NOMINAL DE 16A - FORNECIMENTO E INSTALAÇÃO. AF_04/2016","UN",2,null,null,null,""]
["S",3,"S",0,3,6,1,0,0,0,0,"F","Serviço","Serviço","3.6.1.0.16.","SINAPI",93656,"DISJUNTOR MONOPOLAR TIPO DIN, CORRENTE NOMINAL DE 25A - FORNECIMENTO E INSTALAÇÃO. AF_04/2016","UN",4,null,null,null,""]
["S",3,"S",0,3,6,1,0,0,0,0,"F","Serviço","Serviço","3.6.1.0.17.","SINAPI",93671,"DISJUNTOR TRIPOLAR TIPO DIN, CORRENTE NOMINAL DE 32A - FORNECIMENTO E INSTALAÇÃO. AF_04/2016","UN",1,null,null,null,"Referência: AGETOP - 71173"]
["S",3,"S",0,3,6,1,0,0,0,0,"F","Serviço","Serviço","3.6.1.0.18.","AGETOP",71184,"DISPOSITIVO DE PROTEÇÃO CONTRA SURTOS (D.P.S.) 275V DE 8 A 40KA","Un    ",3,null,null,null,""]
["S",3,"S",0,3,6,1,0,0,0,0,"F","Serviço","Serviço","3.6.1.0.19.","SINAPI",91844,"ELETRODUTO FLEXÍVEL CORRUGADO, PVC, DN 25 MM (3/4\"), PARA CIRCUITOS TERMINAIS, INSTALADO EM LAJE - FORNECIMENTO E INSTALAÇÃO. AF_12/2015","M",100,null,null,null,""]
["S",3,"S",0,3,6,1,0,0,0,0,"F","Serviço","Serviço","3.6.1.0.20.","SINAPI",91846,"ELETRODUTO FLEXÍVEL CORRUGADO, PVC, DN 32 MM (1\"), PARA CIRCUITOS TERMINAIS, INSTALADO EM LAJE - FORNECIMENTO E INSTALAÇÃO. AF_12/2015","M",10,null,null,null,""]
["S",3,"S",0,3,6,1,0,0,0,0,"F","Serviço","Serviço","3.6.1.0.21.","SINAPI",91871,"ELETRODUTO RÍGIDO ROSCÁVEL, PVC, DN 25 MM (3/4\"), PARA CIRCUITOS TERMINAIS, INSTALADO EM PAREDE - FORNECIMENTO E INSTALAÇÃO. AF_12/2015","M",20,null,null,null,"Referência: AGETOP - 71201"]
["S",3,"S",0,3,6,1,0,0,0,0,"F","Serviço","Serviço","3.6.1.0.22.","SINAPI",91872,"ELETRODUTO RÍGIDO ROSCÁVEL, PVC, DN 32 MM (1\"), PARA CIRCUITOS TERMINAIS, INSTALADO EM PAREDE - FORNECIMENTO E INSTALAÇÃO. AF_12/2015","M",20,null,null,null,"Referência: AGETOP - 71202"]
["S",3,"S",0,3,6,1,0,0,0,0,"F","Serviço","Serviço","3.6.1.0.23.","SINAPI",91953,"INTERRUPTOR SIMPLES (1 MÓDULO), 10A/250V, INCLUINDO SUPORTE E PLACA - FORNECIMENTO E INSTALAÇÃO. AF_12/2015","UN",3,null,null,null,"Referência: AGETOP - 71440"]
["S",3,"S",0,3,6,1,0,0,0,0,"F","Serviço","Serviço","3.6.1.0.24.","COMPOSIÇÃO","COMP 387_SEE","LÂMPADA LED TUBULAR 18W ","UN ",30,null,null,null,""]
["S",3,"S",0,3,6,1,0,0,0,0,"F","Serviço","Serviço","3.6.1.0.25.","SINAPI",97585,"LUMINÁRIA TIPO CALHA, DE SOBREPOR, COM 2 LÂMPADAS TUBULARES DE 18 W - FORNECIMENTO E INSTALAÇÃO. AF_11/2017","UN",15,null,null,null,""]
["S",3,"S",0,3,6,1,0,0,{"$f":"IF(OR($C729=\"S\",$C729=0),0,MATCH(0,OFFSET($D729,1,$C729,ROW($C$928)-ROW($C729)),0))","v":0},{"$f":"IF(OR($C729=\"S\",$C729=0),0,MATCH(OFFSET($D729,0,$C729)+1,OFFSET($D729,1,$C729,ROW($C$928)-ROW($C729)),0))","v":0},"F","Serviço","Serviço","3.6.1.0.26.","SINAPI",91884,"LUVA PARA ELETRODUTO, PVC, ROSCÁVEL, DN 25 MM (3/4\"), PARA CIRCUITOS TERMINAIS, INSTALADA EM PAREDE - FORNECIMENTO E INSTALAÇÃO. AF_12/2015","UN",50,null,null,null,"Referência: AGETOP - 71741"]
["S",3,"S",0,3,6,1,0,0,0,0,"F","Serviço","Serviço","3.6.1.0.27.","SINAPI",91885,"LUVA PARA ELETRODUTO, PVC, ROSCÁVEL, DN 32 MM (1\"), PARA CIRCUITOS TERMINAIS, INSTALADA EM PAREDE - FORNECIMENTO E INSTALAÇÃO. AF_12/2015","UN",5,null,null,null,"Referência: AGETOP - 71742"]
["S",3,"S",0,3,6,1,0,0,0,0,"F","Serviço","Serviço","3.6.1.0.28.","AGETOP",72170,"QUADRO DE DISTRIBUIÇÃO DE EMBUTIR EM PVC CB 12E - 80A","Un    ",1,null,null,null,""]
["S",3,"S",0,3,6,1,0,0,0,0,"F","Serviço","Serviço","3.6.1.0.29.","AGETOP",72385,"TAMPA CEGA PARA CONDULETE DE PVC","Un    ",10,null,null,null,""]
["S",3,"S",0,3,6,1,0,0,0,0,"F","Serviço","Serviço","3.6.1.0.30.","SINAPI",92000,"TOMADA BAIXA DE EMBUTIR (1 MÓDULO), 2P+T 10 A, INCLUINDO SUPORTE E PLACA - FORNECIMENTO E INSTALAÇÃO. AF_12/2015","UN",5,null,null,null,"Referência: AGETOP - 72578"]
["S",3,"S",0,3,6,1,0,0,0,0,"F","Serviço","Serviço","3.6.1.0.31.","SINAPI",91993,"TOMADA ALTA DE EMBUTIR (1 MÓDULO), 2P+T 20 A, INCLUINDO SUPORTE E PLACA - FORNECIMENTO E INSTALAÇÃO. AF_12/2015","UN",4,null,null,null,"Referência: AGETOP - 72585"]
[3,3,3,15,3,6,2,0,0,15,113,"F","Nível 3","Nível 3","3.6.2.","SINAPI",null,"SPDA","-",null,null,null,null,""]
["S",3,"S",0,3,6,2,0,0,0,0,"F","Serviço","Serviço","3.6.2.0.1.","SINAPI",72315,"TERMINAL AEREO EM ACO GALVANIZADO COM BASE DE FIXACAO H = 30CM","UN",10,null,null,null,""]
["S",3,"S",0,3,6,2,0,0,0,0,"F","Serviço","Serviço","3.6.2.0.2.","COMPOSIÇÃO","COMP 036_SEE","PRESILHA LATÃO 16/35MM 5MM+PARAF FENDA ","UN ",110,null,null,null,""]
["S",3,"S",0,3,6,2,0,0,0,0,"F","Serviço","Serviço","3.6.2.0.3.","SINAPI",93203,"FIXAÇÃO (ENCUNHAMENTO) DE ALVENARIA DE VEDAÇÃO COM ESPUMA DE POLIURETANO EXPANSIVA. AF_03/2016","M",1,null,null,null,""]
["S",3,"S",0,3,6,2,0,0,0,0,"F","Serviço","Serviço","3.6.2.0.4.","AGETOP",71035,"CONECTOR TIPO PARAFUSO FENDIDO 35 MM2","Un    ",15,null,null,null,""]
[{"$f":"CHOOSE(1+LOG(1+2*(ORÇAMENTO.Nivel=\"Nível 1\")+4*(ORÇAMENTO.Nivel=\"Nível 2\")+8*(ORÇAMENTO.Nivel=\"Nível 3\")+16*(ORÇAMENTO.Nivel=\"Nível 4\")+32*(ORÇAMENTO.Nivel=\"Serviço\"),2),0,1,2,3,4,\"S\")","v":"S"},{"$f":"IF(OR(C740=\"s\",C740=0),OFFSET(B740,-1,0),C740)","v":3},{"$f":"IF(OFFSET(C740,-1,0)=\"L\",1,IF(OFFSET(C740,-1,0)=1,2,IF(OR(A740=\"s\",A740=0),\"S\",IF(AND(OFFSET(C740,-1,0)=2,A740=4),3,IF(AND(OR(OFFSET(C740,-1,0)=\"s\",OFFSET(C740,-1,0)=0),A740<>\"s\",A740>OFFSET(B740,-1,0)),OFFSET(B740,-1,0),A740)))))","v":"S"},{"$f":"IF(OR(C740=\"S\",C740=0),0,IF(ISERROR(K740),J740,SMALL(J740:K740,1)))","v":0},{"$f":"IF($C740=1,OFFSET(E740,-1,0)+1,OFFSET(E740,-1,0))","v":3},{"$f":"IF($C740=1,0,IF($C740=2,OFFSET(F740,-1,0)+1,OFFSET(F740,-1,0)))","v":6},{"$f":"IF(AND($C740<=2,$C740<>0),0,IF($C740=3,OFFSET(G740,-1,0)+1,OFFSET(G740,-1,0)))","v":2},{"$f":"IF(AND($C740<=3,$C740<>0),0,IF($C740=4,OFFSET(H740,-1,0)+1,OFFSET(H740,-1,0)))","v":0},{"$f":"IF(AND($C740<=4,$C740<>0),0,IF(AND($C740=\"S\",$W740>0),OFFSET(I740,-1,0)+1,OFFSET(I740,-1,0)))","v":0},0,0,"F","Serviço","Serviço","3.6.2.0.5.","AGETOP",70543,"CABO DE COBRE NÚ No. 35 MM2","M     ",82,null,null,null,""]
["S",3,"S",0,3,6,2,0,0,0,0,"F","Serviço","Serviço","3.6.2.0.6.","AGETOP",70544,"CABO DE COBRE NÚ No. 50 MM2","M     ",60,null,null,null,""]
["S",3,"S",0,3,6,2,0,0,0,0,"F","Serviço","Serviço","3.6.2.0.7.","SINAPI",91872,"ELETRODUTO RÍGIDO ROSCÁVEL, PVC, DN 32 MM (1\"), PARA CIRCUITOS TERMINAIS, INSTALADO EM PAREDE - FORNECIMENTO E INSTALAÇÃO. AF_12/2015","M",14.52,null,null,null,"Referência: AGETOP - 71202"]
["S",3,"S",0,3,6,2,0,0,0,0,"F","Serviço","Serviço","3.6.2.0.8.","AGETOP",70372,"BRACADEIRA METALICA TIPO \"D\" DIAM. 1\"","Un    ",7.26,null,null,null,""]
["S",3,"S",0,3,6,2,0,0,0,0,"F","Serviço","Serviço","3.6.2.0.9.","SINAPI",96985,"HASTE DE ATERRAMENTO 5/8  PARA SPDA - FORNECIMENTO E INSTALAÇÃO. AF_12/2017","UN",6,null,null,null,""]
["S",3,"S",0,3,6,2,0,0,0,0,"F","Serviço","Serviço","3.6.2.0.10.","SINAPI",98111,"CAIXA DE INSPEÇÃO PARA ATERRAMENTO, CIRCULAR, EM POLIETILENO, DIÂMETRO INTERNO = 0,3 M. AF_05/2018","UN",1,null,null,null,""]
["S",3,"S",0,3,6,2,0,0,0,0,"F","Serviço","Serviço","3.6.2.0.11.","AGETOP",70255,"ATERRAMENTO - SOLDA EXOTÉRMICA - CARTUCHO 90 G","un    ",6,null,null,null,""]
["S",3,"S",0,3,6,2,0,0,0,0,"F","Serviço","Serviço","3.6.2.0.12.","COMPOSIÇÃO","COMP 039_SEE","MOLDE GRAF CGT 5/8 50MM C","UN ",1,null,null,null,""]
["S",3,"S",0,3,6,2,0,0,0,0,"F","Serviço","Serviço","3.6.2.0.13.","COMPOSIÇÃO","COMP 550_SEE","ALIC P/MOLDE C-84","UN ",1,null,null,null,""]
["S",3,"S",0,3,6,2,0,0,0,0,"F","Serviço","Serviço","3.6.2.0.14.","COMPOSIÇÃO","COMP 048_SEE","HASTE ROSQUEADA \"TIRANTE\" 3/8\"","M",6,null,null,null,""]
[2,2,2,8,3,7,0,0,0,49,8,"F","Nível 2","Nível 2","3.7.","SINAPI",null,"INSTALAÇÕES ESPECIAIS","-",null,null,null,null,""]
[3,3,3,7,3,7,1,0,0,7,73,"F","Nível 3","Nível 3","3.7.1.","SINAPI",null,"INSTALAÇÕES DE INCENDIO","-",null,null,null,null,""]
["S",3,"S",0,3,7,1,0,0,0,0,"F","Serviço","Serviço","3.7.1.0.1.","AGETOP",85006,"EXTINTOR MULTI USO EM PO A B C (6 KG) - CAPACIDADE EXTINTORA 3A 20BC","un    ",1,null,null,null,""]
["S",3,"S",0,3,7,1,0,0,0,0,"F","Serviço","Serviço","3.7.1.0.2.","SINAPI",97599,"LUMINÁRIA DE EMERGÊNCIA - FORNECIMENTO E INSTALAÇÃO. AF_11/2017","UN",2,null,null,null,""]
["S",3,"S",0,3,7,1,0,0,0,0,"F","Serviço","Serviço","3.7.1.0.3.","COMPOSIÇÃO","COMP 024_SEE","SINALIZADOR FOTOLUMINESCENTE PARA EXTINTOR","UN ",1,null,null,null,""]
["S",3,"S",0,3,7,1,0,0,0,0,"F","Serviço","Serviço","3.7.1.0.4.","COMPOSIÇÃO","COMP 025_SEE","SINALIZADOR FOTOLUMINESCENTE DE EMERGÊNCIA","UN ",4,null,null,null,""]
["S",3,"S",0,3,7,1,0,0,0,0,"F","Serviço","Serviço","3.7.1.0.5.","COMPOSIÇÃO","COMP 277_SEE","MARCAÇÃO NO PISO - 1X1 M PARA EXTINTOR","M2",1,null,null,null,""]
["S",3,"S",0,3,7,1,0,0,0,0,"F","Serviço","Serviço","3.7.1.0.6.","COMPOSIÇÃO","COMP 412_SEE","PLACA DE SINALIZAÇÃO EM PVC COD 17 - (316X158) MENSAGEM \"SAÍDA\"","UN ",2,null,null,null,""]
[2,2,2,3,3,8,0,0,0,41,3,"F","Nível 2","Nível 2","3.8.",null,null,"ALVENARIAS E DIVISÓRIAS","-",null,null,null,null,""]
["S",2,"S",0,3,8,0,0,0,0,0,"F","Serviço","Serviço","3.8.0.0.1.","SINAPI",87503,"ALVENARIA DE VEDAÇÃO DE BLOCOS CERÂMICOS FURADOS NA HORIZONTAL DE 9X19X19CM (ESPESSURA 9CM) DE PAREDES COM ÁREA LÍQUIDA MAIOR OU IGUAL A 6M² SEM VÃOS E ARGAMASSA DE ASSENTAMENTO COM PREPARO EM BETONEIRA. AF_06/2014","M2",137.08000000000001,null,null,null,"Referência: AGETOP - 100201"]
["S",2,"S",0,3,8,0,0,0,0,0,"F","Serviço","Serviço","3.8.0.0.2.","SINAPI",93201,"FIXAÇÃO (ENCUNHAMENTO) DE ALVENARIA DE VEDAÇÃO COM ARGAMASSA APLICADA COM COLHER. AF_03/2016","M",49.2,null,null,null,""]
[2,2,2,2,3,9,0,0,0,38,2,"F","Nível 2","Nível 2","3.9.",null,null,"IMPERMEABILIZAÇÃO","-",null,null,null,null,""]
["S",2,"S",0,3,9,0,0,0,0,0,"F","Serviço","Serviço","3.9.0.0.1.","SINAPI","74106/1","IMPERMEABILIZACAO DE ESTRUTURAS ENTERRADAS, COM TINTA ASFALTICA, DUAS DEMAOS.","M2",52.77,null,null,null,""]
[2,2,2,2,3,10,0,0,0,36,2,"F","Nível 2","Nível 2","3.10.",null,null,"ESTRUTURAS METÁLICAS","-",null,null,null,null,""]
["S",2,"S",0,3,10,0,0,0,0,0,"F","Serviço","Serviço","3.10.0.0.1.","AGETOP",150103,"ESTRUTURA METÁLICA CONVENCIONAL EM AÇO DO TIPO USI SAC-300 COM FUNDO ANTICORROSIVO","Kg    ",2688.02,null,null,null,""]
[2,2,2,4,3,11,0,0,0,34,4,"F","Nível 2","Nível 2","3.11.",null,null,"COBERTURAS","-",null,null,null,null,""]
["S",2,"S",0,3,11,0,0,0,0,0,"F","Serviço","Serviço","3.11.0.0.1.","SINAPI",94445,"TELHAMENTO COM TELHA CERÂMICA CAPA-CANAL, TIPO PLAN, COM ATÉ 2 ÁGUAS, INCLUSO TRANSPORTE VERTICAL. AF_07/2019","M2",162.19,null,null,null,"Referência: AGETOP - 160401"]
["S",2,"S",0,3,11,0,0,0,0,0,"F","Serviço","Serviço","3.11.0.0.2.","SINAPI",94221,"CUMEEIRA PARA TELHA CERÂMICA EMBOÇADA COM ARGAMASSA TRAÇO 1:2:9 (CIMENTO, CAL E AREIA) PARA TELHADOS COM ATÉ 2 ÁGUAS, INCLUSO TRANSPORTE VERTICAL. AF_07/2019","M",16.55,null,null,null,""]
["S",2,"S",0,3,11,0,0,0,0,0,"F","Serviço","Serviço","3.11.0.0.3.","SINAPI",94224,"EMBOÇAMENTO COM ARGAMASSA TRAÇO 1:2:9 (CIMENTO, CAL E AREIA). AF_07/2019","M",52.7,null,null,null,"Referência: AGETOP - 160403"]
[2,2,2,4,3,12,0,0,0,30,4,"F","Nível 2","Nível 2","3.12.",null,null,"ESQUADRIAS METÁLICAS","-",null,null,null,null,""]
["S",2,"S",0,3,12,0,0,0,0,0,"F","Serviço","Serviço","3.12.0.0.1.","SINAPI",94562,"JANELA DE AÇO DE CORRER, 4 FOLHAS, FIXAÇÃO COM ARGAMASSA, SEM VIDROS, PADRONIZADA. AF_07/2016","M2",9.6,null,null,null,"Referência: AGETOP - 180401"]
["S",2,"S",0,3,12,0,0,0,0,0,"F","Serviço","Serviço","3.12.0.0.2.","SINAPI",94559,"JANELA DE AÇO BASCULANTE, FIXAÇÃO COM ARGAMASSA, SEM VIDROS, PADRONIZADA. AF_07/2016","M2",4.8,null,null,null,"Referência: AGETOP - 180404"]
[{"$f":"CHOOSE(1+LOG(1+2*(ORÇAMENTO.Nivel=\"Nível 1\")+4*(ORÇAMENTO.Nivel=\"Nível 2\")+8*(ORÇAMENTO.Nivel=\"Nível 3\")+16*(ORÇAMENTO.Nivel=\"Nível 4\")+32*(ORÇAMENTO.Nivel=\"Serviço\"),2),0,1,2,3,4,\"S\")","v":"S"},2,"S",0,3,12,0,0,0,0,0,"F","Serviço","Serviço","3.12.0.0.3.","SINAPI","73933/4","PORTA DE FERRO DE ABRIR TIPO BARRA CHATA, COM REQUADRO E GUARNICAO COMPLETA","M2",3.36,null,null,null,"Referência: AGETOP - 180501"]
[2,2,2,2,3,13,0,0,0,26,2,"F","Nível 2","Nível 2","3.13.",null,null,"VIDROS","-",null,null,null,null,""]
["S",2,"S",0,3,13,0,0,0,0,0,"F","Serviço","Serviço","3.13.0.0.1.","SINAPI",72117,"VIDRO LISO COMUM TRANSPARENTE, ESPESSURA 4MM","M2",14.399999999999999,null,null,null,"Referência: AGETOP - 190102"]
[2,2,2,3,3,14,0,0,0,24,3,"F","Nível 2","Nível 2","3.14.",null,null,"REVESTIMENTO DE PAREDE","-",null,null,null,null,""]
["S",2,"S",0,3,14,0,0,0,0,0,"F","Serviço","Serviço","3.14.0.0.1.","SINAPI",87879,"CHAPISCO APLICADO EM ALVENARIAS E ESTRUTURAS DE CONCRETO INTERNAS, COM COLHER DE PEDREIRO.  ARGAMASSA TRAÇO 1:3 COM PREPARO EM BETONEIRA 400L. AF_06/2014","M2",274.18,null,null,null,""]
["S",2,"S",0,3,14,0,0,0,0,0,"F","Serviço","Serviço","3.14.0.0.2.","SINAPI",87548,"MASSA ÚNICA, PARA RECEBIMENTO DE PINTURA, EM ARGAMASSA TRAÇO 1:2:8, PREPARO MANUAL, APLICADA MANUALMENTE EM FACES INTERNAS DE PAREDES, ESPESSURA DE 10MM, COM EXECUÇÃO DE TALISCAS. AF_06/2014","M2",274.18,null,null,null,"Referência: AGETOP - 200500"]
[2,2,2,2,3,15,0,0,0,21,2,"F","Nível 2","Nível 2","3.15.",null,null,"FORROS","-",null,null,null,null,""]
["S",2,"S",0,3,15,0,0,0,0,0,"F","Serviço","Serviço","3.15.0.0.1.","SINAPI",87414,"APLICAÇÃO MANUAL DE GESSO DESEMPENADO (SEM TALISCAS) EM TETO DE AMBIENTES DE ÁREA MAIOR QUE 10M², ESPESSURA DE 1,0CM. AF_06/2014","M2",97.02,null,null,null,"Referência: AGETOP - 210515"]
[2,2,2,5,3,16,0,0,0,19,5,"F","Nível 2","Nível 2","3.16.","SINAPI",null,"REVESTIMENTO DE PISO","-",null,null,null,null,""]
["S",2,"S",0,3,16,0,0,0,0,0,"F","Serviço","Serviço","3.16.0.0.1.","SINAPI",95240,"LASTRO DE CONCRETO MAGRO, APLICADO EM PISOS OU RADIERS, ESPESSURA DE 3 CM. AF_07/2016","M2",119.74,null,null,null,""]
["S",2,"S",0,3,16,0,0,0,0,0,"F","Serviço","Serviço","3.16.0.0.2.","SINAPI",94992,"EXECUÇÃO DE PASSEIO (CALÇADA) OU PISO DE CONCRETO COM CONCRETO MOLDADO IN LOCO, FEITO EM OBRA, ACABAMENTO CONVENCIONAL, ESPESSURA 6 CM, ARMADO. AF_07/2016","M2",29.7,null,null,null,""]
["S",2,"S",0,3,16,0,0,0,0,0,"F","Serviço","Serviço","3.16.0.0.3.","SINAPI",84191,"PISO EM GRANILITE, MARMORITE OU GRANITINA ESPESSURA 8 MM, INCLUSO JUNTAS DE DILATACAO PLASTICAS","M2",124.44,null,null,null,"Referência: AGETOP - 221101"]
["S",2,"S",0,3,16,0,0,0,0,0,"F","Serviço","Serviço","3.16.0.0.4.","AGETOP",221104,"RASPAGEM E APLICAÇÃO RESINA ACRÍLICA DUAS DEMÃOS","m2    ",124.44,null,null,null,""]
[2,2,2,2,3,17,0,0,0,14,2,"F","Nível 2","Nível 2","3.17.","SINAPI",null,"MARCENARIA","-",null,null,null,null,""]
["S",2,"S",0,3,17,0,0,0,0,0,"F","Serviço","Serviço","3.17.0.0.1.","AGETOP",240106,"BATE CARTEIRA ENVERNIZADO E ASSENT. 2,5 X 12 CM","M     ",40.64,null,null,null,""]
[2,2,2,9,3,18,0,0,0,12,9,"F","Nível 2","Nível 2","3.18.","SINAPI",null,"PINTURA","-",null,null,null,null,""]
["S",2,"S",0,3,18,0,0,0,0,0,"F","Serviço","Serviço","3.18.0.0.1.","SINAPI","74145/1","PINTURA ESMALTE FOSCO, DUAS DEMAOS, SOBRE SUPERFICIE METALICA, INCLUSO UMA DEMAO DE FUNDO ANTICORROSIVO. UTILIZACAO DE REVOLVER ( AR-COMPRIMIDO).","M2",162.19,null,null,null,"Referência: AGETOP - 261602"]
["S",2,"S",0,3,18,0,0,0,0,0,"F","Serviço","Serviço","3.18.0.0.2.","SINAPI",88423,"APLICAÇÃO MANUAL DE PINTURA COM TINTA TEXTURIZADA ACRÍLICA EM PAREDES EXTERNAS DE CASAS, UMA COR. AF_06/2014","M2",50.02,null,null,null,"Referência: AGETOP - 260601"]
["S",2,"S",0,3,18,0,0,0,0,0,"F","Serviço","Serviço","3.18.0.0.3.","SINAPI",88489,"APLICAÇÃO MANUAL DE PINTURA COM TINTA LÁTEX ACRÍLICA EM PAREDES, DUAS DEMÃOS. AF_06/2014","M2",104.42,null,null,null,"Referência: AGETOP - 261001"]
["S",2,"S",0,3,18,0,0,0,0,0,"F","Serviço","Serviço","3.18.0.0.4.","SINAPI",88497,"APLICAÇÃO E LIXAMENTO DE MASSA LÁTEX EM PAREDES, DUAS DEMÃOS. AF_06/2014","M2",215.73000000000002,null,null,null,"Referência: AGETOP - 261300"]
["S",2,"S",0,3,18,0,0,0,0,0,"F","Serviço","Serviço","3.18.0.0.5.","AGETOP",261550,"PINT.ESMALTE SINT.PAREDES - 2 DEM.C/SELADOR","m2    ",111.31,null,null,null,""]
["S",2,"S",0,3,18,0,0,0,{"$f":"IF(OR($C793=\"S\",$C793=0),0,MATCH(0,OFFSET($D793,1,$C793,ROW($C$928)-ROW($C793)),0))","v":0},{"$f":"IF(OR($C793=\"S\",$C793=0),0,MATCH(OFFSET($D793,0,$C793)+1,OFFSET($D793,1,$C793,ROW($C$928)-ROW($C793)),0))","v":0},"F","Serviço","Serviço","3.18.0.0.6.","SINAPI",88496,"APLICAÇÃO E LIXAMENTO DE MASSA LÁTEX EM TETO, DUAS DEMÃOS. AF_06/2014","M2",97.02,null,null,null,"Referência: AGETOP - 261300"]
["S",2,"S",0,3,18,0,0,0,0,0,"F","Serviço","Serviço","3.18.0.0.7.","SINAPI",88486,"APLICAÇÃO MANUAL DE PINTURA COM TINTA LÁTEX PVA EM TETO, DUAS DEMÃOS. AF_06/2014","M2",97.02,null,null,null,"Referência: AGETOP - 261307"]
["S",2,"S",0,3,18,0,0,0,0,0,"F","Serviço","Serviço","3.18.0.0.8.","SINAPI","74145/1","PINTURA ESMALTE FOSCO, DUAS DEMAOS, SOBRE SUPERFICIE METALICA, INCLUSO UMA DEMAO DE FUNDO ANTICORROSIVO. UTILIZACAO DE REVOLVER ( AR-COMPRIMIDO).","M2",38.880000000000003,null,null,null,"Referência: AGETOP - 261602"]
[2,2,2,3,3,19,0,0,0,3,{"$error":"#N/A"},"F","Nível 2","Nível 2","3.19.","SINAPI",null,"DIVERSOS","-",null,null,null,null,""]
["S",2,"S",0,3,19,0,0,0,0,0,"F","Serviço","Serviço","3.19.0.0.1.","AGETOP",271210,"QUADRO DE GIZ EMBOÇO/PINTURA COMPLETO","m2    ",10.08,null,null,null,""]
["S",2,"S",0,3,19,0,0,0,0,0,"F","Serviço","Serviço","3.19.0.0.2.","AGETOP",270501,"LIMPEZA FINAL DE OBRA - (OBRAS CIVIS)","m2    ",127.26,null,null,null,""]
[1,1,1,129,4,0,0,0,0,129,{"$error":"#N/A"},"F","Nível 1","Nível 1","4.","AGETOP",null,"QUADRA EM ARCO PADRÃO SEDUC - MOD 03","-",null,null,null,null,""]
[2,2,2,2,4,1,0,0,0,128,2,"F","Nível 2","Nível 2","4.1.","AGETOP",null,"SERVIÇOS PRELIMINARES","-",null,null,null,null,""]
["S",2,"S",0,4,1,0,0,0,0,0,"F","Serviço","Serviço","4.1.0.0.1.","AGETOP",20701,"LOCAÇÃO DA OBRA, EXECUÇÃO DE GABARITO SEM REAPROVEITAMENTO, INCLUSO PINTURA (FACE INTERNA DO RIPÃO 15CM) E PIQUETE COM TESTEMUNHA","m2    ",687.44,null,null,null,""]
[2,2,2,7,4,2,0,0,0,126,7,"F","Nível 2","Nível 2","4.2.","AGETOP",null,"SERVIÇO EM TERRA","-",null,null,null,null,""]
[3,3,3,6,4,2,1,0,0,6,21,"F","Nível 3","Nível 3","4.2.1.","SINAPI",null,"ARQUIBANCADA","-",null,null,null,null,""]
[{"$f":"CHOOSE(1+LOG(1+2*(ORÇAMENTO.Nivel=\"Nível 1\")+4*(ORÇAMENTO.Nivel=\"Nível 2\")+8*(ORÇAMENTO.Nivel=\"Nível 3\")+16*(ORÇAMENTO.Nivel=\"Nível 4\")+32*(ORÇAMENTO.Nivel=\"Serviço\"),2),0,1,2,3,4,\"S\")","v":"S"},{"$f":"IF(OR(C804=\"s\",C804=0),OFFSET(B804,-1,0),C804)","v":3},{"$f":"IF(OFFSET(C804,-1,0)=\"L\",1,IF(OFFSET(C804,-1,0)=1,2,IF(OR(A804=\"s\",A804=0),\"S\",IF(AND(OFFSET(C804,-1,0)=2,A804=4),3,IF(AND(OR(OFFSET(C804,-1,0)=\"s\",OFFSET(C804,-1,0)=0),A804<>\"s\",A804>OFFSET(B804,-1,0)),OFFSET(B804,-1,0),A804)))))","v":"S"},{"$f":"IF(OR(C804=\"S\",C804=0),0,IF(ISERROR(K804),J804,SMALL(J804:K804,1)))","v":0},{"$f":"IF($C804=1,OFFSET(E804,-1,0)+1,OFFSET(E804,-1,0))","v":4},{"$f":"IF($C804=1,0,IF($C804=2,OFFSET(F804,-1,0)+1,OFFSET(F804,-1,0)))","v":2},{"$f":"IF(AND($C804<=2,$C804<>0),0,IF($C804=3,OFFSET(G804,-1,0)+1,OFFSET(G804,-1,0)))","v":1},{"$f":"IF(AND($C804<=3,$C804<>0),0,IF($C804=4,OFFSET(H804,-1,0)+1,OFFSET(H804,-1,0)))","v":0},{"$f":"IF(AND($C804<=4,$C804<>0),0,IF(AND($C804=\"S\",$W804>0),OFFSET(I804,-1,0)+1,OFFSET(I804,-1,0)))","v":0},0,0,"F","Serviço","Serviço","4.2.1.0.1.","SINAPI",79480,"ESCAVACAO MECANICA CAMPO ABERTO EM SOLO EXCETO ROCHA ATE 2,00M PROFUNDIDADE","M3",15.92,null,null,null,"Referência: AGETOP - 41004"]
["S",3,"S",0,4,2,1,0,0,0,0,"F","Serviço","Serviço","4.2.1.0.2.","SINAPI",72898,"CARGA E DESCARGA MECANIZADAS DE ENTULHO EM CAMINHAO BASCULANTE 6 M3","M3",15.92,null,null,null,"Referência: AGETOP - 41005"]
["S",3,"S",0,4,2,1,0,0,0,0,"F","Serviço","Serviço","4.2.1.0.3.","AGETOP",41012,"INDENIZAÇÃO DE JAZIDA","m3    ",15.92,null,null,null,""]
["S",3,"S",0,4,2,1,0,0,0,0,"F","Serviço","Serviço","4.2.1.0.4.","AGETOP",41006,"TRANSPORTE DE MATERIAL ESCAVADO M3.KM","m3km  ",159.19999999999999,null,null,null,""]
["S",3,"S",0,4,2,1,0,0,0,0,"","Serviço","Serviço","-","SINAPI","74005/2","(sem código)","-",12.74,null,null,null,""]
[2,2,2,3,4,3,0,0,0,119,3,"F","Nível 2","Nível 2","4.3.","SINAPI",null,"TRANSPORTES","-",null,null,null,null,""]
["S",2,"S",0,4,3,0,0,0,0,0,"F","Serviço","Serviço","4.3.0.0.1.","SINAPI",72897,"CARGA MANUAL DE ENTULHO EM CAMINHAO BASCULANTE 6 M3","M3",48.12,null,null,null,""]
["S",2,"S",0,4,3,0,0,0,0,0,"F","Serviço","Serviço","4.3.0.0.2.","SINAPI",72900,"TRANSPORTE DE ENTULHO COM CAMINHAO BASCULANTE 6 M3, RODOVIA PAVIMENTADA, DMT 0,5 A 1,0 KM","M3",48.12,null,null,null,""]
[2,2,2,23,4,4,0,0,0,116,23,"F","Nível 2","Nível 2","4.4.","AGETOP",null,"FUNDAÇÕES E SONDAGENS","-",null,null,null,null,""]
[3,3,3,11,4,4,1,0,0,22,11,"F","Nível 3","Nível 3","4.4.1.","SINAPI",null,"ESTACAS E BLOCOS","-",null,null,null,null,""]
["S",3,"S",0,4,4,1,0,0,0,0,"F","Serviço","Serviço","4.4.1.0.1.","AGETOP",50302,"ESTACA A TRADO DIAM.30 CM SEM FERRO","M     ",147,null,null,null,""]
["S",3,"S",0,4,4,1,0,0,0,0,"F","Serviço","Serviço","4.4.1.0.2.","AGETOP",60209,"FORMA CH.COMPENSADA 12MM-VIGA/PILAR U=4V - (OBRAS CIVIS","m2    ",30.24,null,null,null,""]
["S",3,"S",0,4,4,1,0,0,0,0,"F","Serviço","Serviço","4.4.1.0.3.","SINAPI",96523,"ESCAVAÇÃO MANUAL PARA BLOCO DE COROAMENTO OU SAPATA, COM PREVISÃO DE FÔRMA. AF_06/2017","M3",9.7899999999999991,null,null,null,"Referência: AGETOP - 50901"]
["S",3,"S",0,4,4,1,0,0,0,0,"F","Serviço","Serviço","4.4.1.0.4.","AGETOP",50902,"APILOAMENTO (BLOCOS/SAPATAS)","m2    ",10.8,null,null,null,""]
["S",3,"S",0,4,4,1,0,0,0,0,"F","Serviço","Serviço","4.4.1.0.5.","SINAPI",96995,"REATERRO MANUAL APILOADO COM SOQUETE. AF_10/2017","M3",2.6999999999999993,null,null,null,"Referência: AGETOP - 40902"]
["S",3,"S",0,4,4,1,0,0,0,0,"F","Serviço","Serviço","4.4.1.0.6.","SINAPI",94964,"CONCRETO FCK = 20MPA, TRAÇO 1:2,7:3 (CIMENTO/ AREIA MÉDIA/ BRITA 1)  - PREPARO MECÂNICO COM BETONEIRA 400 L. AF_07/2016","M3",7.09,null,null,null,""]
["S",3,"S",0,4,4,1,0,0,0,0,"F","Serviço","Serviço","4.4.1.0.7.","SINAPI","74157/4","LANCAMENTO/APLICACAO MANUAL DE CONCRETO EM FUNDACOES","M3",7.09,null,null,null,"Referência: AGETOP - 51026"]
["S",3,"S",0,4,4,1,0,0,0,0,"F","Serviço","Serviço","4.4.1.0.8.","SINAPI",96544,"ARMAÇÃO DE BLOCO, VIGA BALDRAME OU SAPATA UTILIZANDO AÇO CA-50 DE 6,3 MM - MONTAGEM. AF_06/2017","KG",129.09,null,null,null,"Referência: AGETOP - 52003"]
["S",3,"S",0,4,4,1,0,0,0,0,"F","Serviço","Serviço","4.4.1.0.9.","SINAPI",96545,"ARMAÇÃO DE BLOCO, VIGA BALDRAME OU SAPATA UTILIZANDO AÇO CA-50 DE 8 MM - MONTAGEM. AF_06/2017","KG",247.81,null,null,null,"Referência: AGETOP - 52004"]
["S",3,"S",0,4,4,1,0,0,0,0,"F","Serviço","Serviço","4.4.1.0.10.","SINAPI",96543,"ARMAÇÃO DE BLOCO, VIGA BALDRAME E SAPATA UTILIZANDO AÇO CA-60 DE 5 MM - MONTAGEM. AF_06/2017","KG",96,null,null,null,"Referência: AGETOP - 52014"]
[3,3,3,11,4,4,2,0,0,11,24,"F","Nível 3","Nível 3","4.4.2.","SINAPI",null,"VIGAS BALDRAMES","-",null,null,null,null,""]
["S",3,"S",0,4,4,2,0,0,0,0,"F","Serviço","Serviço","4.4.2.0.1.","AGETOP",60191,"FORMA DE TABUA CINTA BALDRAME U=8 VEZES","m2    ",114.96,null,null,null,""]
["S",3,"S",0,4,4,2,0,0,0,0,"F","Serviço","Serviço","4.4.2.0.2.","SINAPI",96523,"ESCAVAÇÃO MANUAL PARA BLOCO DE COROAMENTO OU SAPATA, COM PREVISÃO DE FÔRMA. AF_06/2017","M3",16.543333333333333,null,null,null,"Referência: AGETOP - 50901"]
["S",3,"S",0,4,4,2,0,0,0,0,"F","Serviço","Serviço","4.4.2.0.3.","AGETOP",50902,"APILOAMENTO (BLOCOS/SAPATAS)","m2    ",23,null,null,null,""]
["S",3,"S",0,4,4,2,0,0,0,0,"F","Serviço","Serviço","4.4.2.0.4.","SINAPI",96995,"REATERRO MANUAL APILOADO COM SOQUETE. AF_10/2017","M3",9.4533333333333331,null,null,null,"Referência: AGETOP - 40902"]
["S",3,"S",0,4,4,2,0,0,0,0,"F","Serviço","Serviço","4.4.2.0.5.","SINAPI",94964,"CONCRETO FCK = 20MPA, TRAÇO 1:2,7:3 (CIMENTO/ AREIA MÉDIA/ BRITA 1)  - PREPARO MECÂNICO COM BETONEIRA 400 L. AF_07/2016","M3",7.09,null,null,null,""]
["S",3,"S",0,4,4,2,0,0,0,0,"F","Serviço","Serviço","4.4.2.0.6.","SINAPI","74157/4","LANCAMENTO/APLICACAO MANUAL DE CONCRETO EM FUNDACOES","M3",7.09,null,null,null,"Referência: AGETOP - 51026"]
["S",3,"S",0,4,4,2,0,0,0,0,"F","Serviço","Serviço","4.4.2.0.7.","SINAPI",96544,"ARMAÇÃO DE BLOCO, VIGA BALDRAME OU SAPATA UTILIZANDO AÇO CA-50 DE 6,3 MM - MONTAGEM. AF_06/2017","KG",62.72,null,null,null,"Referência: AGETOP - 52003"]
["S",3,"S",0,4,4,2,0,0,0,0,"F","Serviço","Serviço","4.4.2.0.8.","SINAPI",96545,"ARMAÇÃO DE BLOCO, VIGA BALDRAME OU SAPATA UTILIZANDO AÇO CA-50 DE 8 MM - MONTAGEM. AF_06/2017","KG",117.36,null,null,null,"Referência: AGETOP - 52004"]
["S",3,"S",0,4,4,2,0,0,0,0,"F","Serviço","Serviço","4.4.2.0.9.","SINAPI",96546,"ARMAÇÃO DE BLOCO, VIGA BALDRAME OU SAPATA UTILIZANDO AÇO CA-50 DE 10 MM - MONTAGEM. AF_06/2017","KG",192,null,null,null,"Referência: AGETOP - 52005"]
["S",3,"S",0,4,4,2,0,0,0,0,"F","Serviço","Serviço","4.4.2.0.10.","SINAPI",96543,"ARMAÇÃO DE BLOCO, VIGA BALDRAME E SAPATA UTILIZANDO AÇO CA-60 DE 5 MM - MONTAGEM. AF_06/2017","KG",106.36,null,null,null,"Referência: AGETOP - 52014"]
[2,2,2,26,4,5,0,0,0,93,26,"F","Nível 2","Nível 2","4.5.","SINAPI",null,"ESTRUTURA","-",null,null,null,null,""]
[{"$f":"CHOOSE(1+LOG(1+2*(ORÇAMENTO.Nivel=\"Nível 1\")+4*(ORÇAMENTO.Nivel=\"Nível 2\")+8*(ORÇAMENTO.Nivel=\"Nível 3\")+16*(ORÇAMENTO.Nivel=\"Nível 4\")+32*(ORÇAMENTO.Nivel=\"Serviço\"),2),0,1,2,3,4,\"S\")","v":3},3,3,6,4,5,1,0,0,25,6,"F","Nível 3","Nível 3","4.5.1.","SINAPI",null,"PILARES E CONSOLOS","-",null,null,null,null,""]
["S",3,"S",0,4,5,1,0,0,0,0,"F","Serviço","Serviço","4.5.1.0.1.","AGETOP",60209,"FORMA CH.COMPENSADA 12MM-VIGA/PILAR U=4V - (OBRAS CIVIS","m2    ",84.96,null,null,null,""]
["S",3,"S",0,4,5,1,0,0,0,0,"F","Serviço","Serviço","4.5.1.0.2.","SINAPI",94964,"CONCRETO FCK = 20MPA, TRAÇO 1:2,7:3 (CIMENTO/ AREIA MÉDIA/ BRITA 1)  - PREPARO MECÂNICO COM BETONEIRA 400 L. AF_07/2016","M3",5.66,null,null,null,""]
["S",3,"S",0,4,5,1,0,0,0,0,"F","Serviço","Serviço","4.5.1.0.3.","SINAPI",92873,"LANÇAMENTO COM USO DE BALDES, ADENSAMENTO E ACABAMENTO DE CONCRETO EM ESTRUTURAS. AF_12/2015","M3",5.66,null,null,null,"Referência: AGETOP - 60801"]
["S",3,"S",0,4,5,1,0,0,0,0,"F","Serviço","Serviço","4.5.1.0.4.","SINAPI",92778,"ARMAÇÃO DE PILAR OU VIGA DE UMA ESTRUTURA CONVENCIONAL DE CONCRETO ARMADO EM UMA EDIFICAÇÃO TÉRREA OU SOBRADO UTILIZANDO AÇO CA-50 DE 10,0 MM - MONTAGEM. AF_12/2015","KG",535,null,null,null,"Referência: AGETOP - 60305"]
["S",3,"S",0,4,5,1,0,0,0,0,"F","Serviço","Serviço","4.5.1.0.5.","SINAPI",92775,"ARMAÇÃO DE PILAR OU VIGA DE UMA ESTRUTURA CONVENCIONAL DE CONCRETO ARMADO EM UMA EDIFICAÇÃO TÉRREA OU SOBRADO UTILIZANDO AÇO CA-60 DE 5,0 MM - MONTAGEM. AF_12/2015","KG",133.19,null,null,null,"Referência: AGETOP - 60314"]
[3,3,3,6,4,5,2,0,0,19,6,"F","Nível 3","Nível 3","4.5.2.","SINAPI",null,"PILARETES","-",null,null,null,null,""]
["S",3,"S",0,4,5,2,0,0,0,0,"F","Serviço","Serviço","4.5.2.0.1.","AGETOP",60209,"FORMA CH.COMPENSADA 12MM-VIGA/PILAR U=4V - (OBRAS CIVIS","m2    ",43.32,null,null,null,""]
["S",3,"S",0,4,5,2,0,0,0,0,"F","Serviço","Serviço","4.5.2.0.2.","SINAPI",94964,"CONCRETO FCK = 20MPA, TRAÇO 1:2,7:3 (CIMENTO/ AREIA MÉDIA/ BRITA 1)  - PREPARO MECÂNICO COM BETONEIRA 400 L. AF_07/2016","M3",1.9,null,null,null,""]
["S",3,"S",0,4,5,2,0,0,0,0,"F","Serviço","Serviço","4.5.2.0.3.","SINAPI",92873,"LANÇAMENTO COM USO DE BALDES, ADENSAMENTO E ACABAMENTO DE CONCRETO EM ESTRUTURAS. AF_12/2015","M3",1.9,null,null,null,"Referência: AGETOP - 60801"]
["S",3,"S",0,4,5,2,0,0,0,0,"F","Serviço","Serviço","4.5.2.0.4.","SINAPI",92777,"ARMAÇÃO DE PILAR OU VIGA DE UMA ESTRUTURA CONVENCIONAL DE CONCRETO ARMADO EM UMA EDIFICAÇÃO TÉRREA OU SOBRADO UTILIZANDO AÇO CA-50 DE 8,0 MM - MONTAGEM. AF_12/2015","KG",145.27000000000001,null,null,null,"Referência: AGETOP - 60304"]
["S",3,"S",0,4,5,2,0,0,0,0,"F","Serviço","Serviço","4.5.2.0.5.","SINAPI",92775,"ARMAÇÃO DE PILAR OU VIGA DE UMA ESTRUTURA CONVENCIONAL DE CONCRETO ARMADO EM UMA EDIFICAÇÃO TÉRREA OU SOBRADO UTILIZANDO AÇO CA-60 DE 5,0 MM - MONTAGEM. AF_12/2015","KG",56.45,null,null,null,"Referência: AGETOP - 60314"]
[3,3,3,7,4,5,3,0,0,13,7,"F","Nível 3","Nível 3","4.5.3.","SINAPI",null,"VIGAS DE COBERTURA","-",null,null,null,null,""]
["S",3,"S",0,4,5,3,0,0,0,0,"F","Serviço","Serviço","4.5.3.0.1.","AGETOP",60209,"FORMA CH.COMPENSADA 12MM-VIGA/PILAR U=4V - (OBRAS CIVIS","m2    ",60.61,null,null,null,""]
["S",3,"S",0,4,5,3,0,0,0,0,"F","Serviço","Serviço","4.5.3.0.2.","SINAPI",94964,"CONCRETO FCK = 20MPA, TRAÇO 1:2,7:3 (CIMENTO/ AREIA MÉDIA/ BRITA 1)  - PREPARO MECÂNICO COM BETONEIRA 400 L. AF_07/2016","M3",3.83,null,null,null,""]
["S",3,"S",0,4,5,3,0,0,0,0,"F","Serviço","Serviço","4.5.3.0.3.","SINAPI",92873,"LANÇAMENTO COM USO DE BALDES, ADENSAMENTO E ACABAMENTO DE CONCRETO EM ESTRUTURAS. AF_12/2015","M3",3.83,null,null,null,"Referência: AGETOP - 60801"]
["S",3,"S",0,4,5,3,0,0,0,0,"F","Serviço","Serviço","4.5.3.0.4.","SINAPI",92776,"ARMAÇÃO DE PILAR OU VIGA DE UMA ESTRUTURA CONVENCIONAL DE CONCRETO ARMADO EM UMA EDIFICAÇÃO TÉRREA OU SOBRADO UTILIZANDO AÇO CA-50 DE 6,3 MM - MONTAGEM. AF_12/2015","KG",62.45,null,null,null,"Referência: AGETOP - 60303"]
["S",3,"S",0,4,5,3,0,0,0,0,"F","Serviço","Serviço","4.5.3.0.5.","SINAPI",92778,"ARMAÇÃO DE PILAR OU VIGA DE UMA ESTRUTURA CONVENCIONAL DE CONCRETO ARMADO EM UMA EDIFICAÇÃO TÉRREA OU SOBRADO UTILIZANDO AÇO CA-50 DE 10,0 MM - MONTAGEM. AF_12/2015","KG",205.36,null,null,null,"Referência: AGETOP - 60305"]
["S",3,"S",0,4,5,3,0,0,0,0,"F","Serviço","Serviço","4.5.3.0.6.","SINAPI",92775,"ARMAÇÃO DE PILAR OU VIGA DE UMA ESTRUTURA CONVENCIONAL DE CONCRETO ARMADO EM UMA EDIFICAÇÃO TÉRREA OU SOBRADO UTILIZANDO AÇO CA-60 DE 5,0 MM - MONTAGEM. AF_12/2015","KG",52.27,null,null,null,"Referência: AGETOP - 60314"]
[3,3,3,6,4,5,4,0,0,6,{"$error":"#N/A"},"F","Nível 3","Nível 3","4.5.4.","SINAPI",null,"CINTAMENTO","-",null,null,null,null,""]
["S",3,"S",0,4,5,4,0,0,0,0,"F","Serviço","Serviço","4.5.4.0.1.","AGETOP",60209,"FORMA CH.COMPENSADA 12MM-VIGA/PILAR U=4V - (OBRAS CIVIS","m2    ",50.22,null,null,null,""]
["S",3,"S",0,4,5,4,0,0,{"$f":"IF(OR($C857=\"S\",$C857=0),0,MATCH(0,OFFSET($D857,1,$C857,ROW($C$928)-ROW($C857)),0))","v":0},{"$f":"IF(OR($C857=\"S\",$C857=0),0,MATCH(OFFSET($D857,0,$C857)+1,OFFSET($D857,1,$C857,ROW($C$928)-ROW($C857)),0))","v":0},"F","Serviço","Serviço","4.5.4.0.2.","SINAPI",94964,"CONCRETO FCK = 20MPA, TRAÇO 1:2,7:3 (CIMENTO/ AREIA MÉDIA/ BRITA 1)  - PREPARO MECÂNICO COM BETONEIRA 400 L. AF_07/2016","M3",2.52,null,null,null,""]
["S",3,"S",0,4,5,4,0,0,0,0,"F","Serviço","Serviço","4.5.4.0.3.","SINAPI",92873,"LANÇAMENTO COM USO DE BALDES, ADENSAMENTO E ACABAMENTO DE CONCRETO EM ESTRUTURAS. AF_12/2015","M3",2.52,null,null,null,"Referência: AGETOP - 60801"]
["S",3,"S",0,4,5,4,0,0,0,0,"F","Serviço","Serviço","4.5.4.0.4.","SINAPI",92777,"ARMAÇÃO DE PILAR OU VIGA DE UMA ESTRUTURA CONVENCIONAL DE CONCRETO ARMADO EM UMA EDIFICAÇÃO TÉRREA OU SOBRADO UTILIZANDO AÇO CA-50 DE 8,0 MM - MONTAGEM. AF_12/2015","KG",145.63,null,null,null,"Referência: AGETOP - 60304"]
["S",3,"S",0,4,5,4,0,0,0,0,"F","Serviço","Serviço","4.5.4.0.5.","SINAPI",92775,"ARMAÇÃO DE PILAR OU VIGA DE UMA ESTRUTURA CONVENCIONAL DE CONCRETO ARMADO EM UMA EDIFICAÇÃO TÉRREA OU SOBRADO UTILIZANDO AÇO CA-60 DE 5,0 MM - MONTAGEM. AF_12/2015","KG",42.9,null,null,null,"Referência: AGETOP - 60314"]
[2,2,2,28,4,6,0,0,0,67,28,"F","Nível 2","Nível 2","4.6.",null,null,"INSTALAÇÕES ELÉTRICAS","-",null,null,null,null,""]
["S",2,"S",0,4,6,0,0,0,0,0,"F","Serviço","Serviço","4.6.0.0.1.","AGETOP",70351,"BRACADEIRA METALICA TIPO \"U\" DIAM. 3/4\"","Un    ",65,null,null,null,""]
["S",2,"S",0,4,6,0,0,0,0,0,"F","Serviço","Serviço","4.6.0.0.2.","SINAPI",91170,"FIXAÇÃO DE TUBOS HORIZONTAIS DE PVC, CPVC OU COBRE DIÂMETROS MENORES OU IGUAIS A 40 MM OU ELETROCALHAS ATÉ 150MM DE LARGURA, COM ABRAÇADEIRA METÁLICA RÍGIDA TIPO D 1/2\u0094, FIXADA EM PERFILADO EM LAJE. AF_05/2015","M",15,null,null,null,""]
["S",2,"S",0,4,6,0,0,0,0,0,"F","Serviço","Serviço","4.6.0.0.3.","AGETOP",71277,"EMENDA INTERNA P/ELETROCALHA (50 X 50 mm)","Un    ",10,null,null,null,""]
["S",2,"S",0,4,6,0,0,0,0,0,"F","Serviço","Serviço","4.6.0.0.4.","AGETOP",72376,"TAMPA DE ENCAIXE PARA ELETROCALHA DE 50 X 50 MM","M     ",30,null,null,null,""]
["S",2,"S",0,4,6,0,0,0,0,0,"F","Serviço","Serviço","4.6.0.0.5.","SINAPI",91940,"CAIXA RETANGULAR 4\" X 2\" MÉDIA (1,30 M DO PISO), PVC, INSTALADA EM PAREDE - FORNECIMENTO E INSTALAÇÃO. AF_12/2015","UN",4,null,null,null,""]
["S",2,"S",0,4,6,0,0,0,0,0,"F","Serviço","Serviço","4.6.0.0.6.","AGETOP",70714,"CAIXA DE PASSAGEM 50X50X80CM FUNDO DE BRITA SEM TAMPA","Un    ",1,null,null,null,""]
[{"$f":"CHOOSE(1+LOG(1+2*(ORÇAMENTO.Nivel=\"Nível 1\")+4*(ORÇAMENTO.Nivel=\"Nível 2\")+8*(ORÇAMENTO.Nivel=\"Nível 3\")+16*(ORÇAMENTO.Nivel=\"Nível 4\")+32*(ORÇAMENTO.Nivel=\"Serviço\"),2),0,1,2,3,4,\"S\")","v":"S"},{"$f":"IF(OR(C868=\"s\",C868=0),OFFSET(B868,-1,0),C868)","v":2},{"$f":"IF(OFFSET(C868,-1,0)=\"L\",1,IF(OFFSET(C868,-1,0)=1,2,IF(OR(A868=\"s\",A868=0),\"S\",IF(AND(OFFSET(C868,-1,0)=2,A868=4),3,IF(AND(OR(OFFSET(C868,-1,0)=\"s\",OFFSET(C868,-1,0)=0),A868<>\"s\",A868>OFFSET(B868,-1,0)),OFFSET(B868,-1,0),A868)))))","v":"S"},{"$f":"IF(OR(C868=\"S\",C868=0),0,IF(ISERROR(K868),J868,SMALL(J868:K868,1)))","v":0},{"$f":"IF($C868=1,OFFSET(E868,-1,0)+1,OFFSET(E868,-1,0))","v":4},{"$f":"IF($C868=1,0,IF($C868=2,OFFSET(F868,-1,0)+1,OFFSET(F868,-1,0)))","v":6},{"$f":"IF(AND($C868<=2,$C868<>0),0,IF($C868=3,OFFSET(G868,-1,0)+1,OFFSET(G868,-1,0)))","v":0},{"$f":"IF(AND($C868<=3,$C868<>0),0,IF($C868=4,OFFSET(H868,-1,0)+1,OFFSET(H868,-1,0)))","v":0},{"$f":"IF(AND($C868<=4,$C868<>0),0,IF(AND($C868=\"S\",$W868>0),OFFSET(I868,-1,0)+1,OFFSET(I868,-1,0)))","v":0},0,0,"F","Serviço","Serviço","4.6.0.0.7.","AGETOP",71190,"ELETROCALHA CH.Aº PRE ZN. FOGO \"C\" C/ABAS 50X50 MM S/TAMPA","M     ",30,null,null,null,""]
["S",2,"S",0,4,6,0,0,0,0,0,"F","Serviço","Serviço","4.6.0.0.8.","AGETOP",71291,"FIO ISOLADO PVC 750 V, No. 2,5 MM2","M     ",500,null,null,null,""]
["S",2,"S",0,4,6,0,0,0,0,0,"F","Serviço","Serviço","4.6.0.0.9.","AGETOP",71660,"LUMINÁRIA CIRCULAR COM VIDRO PARA QUADRA ATÉ 400 W - BASE E-40","Un    ",12,null,null,null,""]
["S",2,"S",0,4,6,0,0,0,0,0,"F","Serviço","Serviço","4.6.0.0.10.","AGETOP",71522,"LAMPADA A VAPOR MERCURIO 400 W","Un    ",12,null,null,null,""]
["S",2,"S",0,4,6,0,0,0,0,0,"F","Serviço","Serviço","4.6.0.0.11.","AGETOP",70421,"BUCHA E ARRUELA METALICA DIAM. 3/4\"","PR    ",12,null,null,null,""]
["S",2,"S",0,4,6,0,0,0,0,0,"F","Serviço","Serviço","4.6.0.0.12.","AGETOP",70422,"BUCHA E ARRUELA METALICA DIAM. 1\"","PR    ",1,null,null,null,""]
["S",2,"S",0,4,6,0,0,0,0,0,"F","Serviço","Serviço","4.6.0.0.13.","AGETOP",72170,"QUADRO DE DISTRIBUIÇÃO DE EMBUTIR EM PVC CB 12E - 80A","Un    ",1,null,null,null,""]
["S",2,"S",0,4,6,0,0,0,0,0,"F","Serviço","Serviço","4.6.0.0.14.","AGETOP",72250,"REATOR EXTERNO V. MERCÚRIO  AFP 1 X 400 W","Un    ",12,null,null,null,""]
["S",2,"S",0,4,6,0,0,0,0,0,"F","Serviço","Serviço","4.6.0.0.15.","AGETOP",70924,"CONDULETE DE PVC - CAIXA COM 5 ENTRADAS ","un    ",16,null,null,null,""]
["S",2,"S",0,4,6,0,0,0,0,0,"F","Serviço","Serviço","4.6.0.0.16.","AGETOP",72385,"TAMPA CEGA PARA CONDULETE DE PVC","Un    ",16,null,null,null,""]
["S",2,"S",0,4,6,0,0,0,0,0,"F","Serviço","Serviço","4.6.0.0.17.","SINAPI",92868,"CAIXA RETANGULAR 4\" X 2\" MÉDIA (1,30 M DO PISO), METÁLICA, INSTALADA EM PAREDE - FORNECIMENTO E INSTALAÇÃO. AF_12/2015","UN",4,null,null,null,"Referência: AGETOP - 70691"]
["S",2,"S",0,4,6,0,0,0,0,0,"F","Serviço","Serviço","4.6.0.0.18.","SINAPI",91902,"CURVA 90 GRAUS PARA ELETRODUTO, PVC, ROSCÁVEL, DN 25 MM (3/4\"), PARA CIRCUITOS TERMINAIS, INSTALADA EM LAJE - FORNECIMENTO E INSTALAÇÃO. AF_12/2015","UN",8,null,null,null,"Referência: AGETOP - 71141"]
["S",2,"S",0,4,6,0,0,0,0,0,"F","Serviço","Serviço","4.6.0.0.19.","SINAPI",91905,"CURVA 90 GRAUS PARA ELETRODUTO, PVC, ROSCÁVEL, DN 32 MM (1\"), PARA CIRCUITOS TERMINAIS, INSTALADA EM LAJE - FORNECIMENTO E INSTALAÇÃO. AF_12/2015","UN",1,null,null,null,"Referência: AGETOP - 71142"]
["S",2,"S",0,4,6,0,0,0,0,0,"F","Serviço","Serviço","4.6.0.0.20.","SINAPI",93655,"DISJUNTOR MONOPOLAR TIPO DIN, CORRENTE NOMINAL DE 20A - FORNECIMENTO E INSTALAÇÃO. AF_04/2016","UN",5,null,null,null,""]
["S",2,"S",0,4,6,0,0,0,0,0,"F","Serviço","Serviço","4.6.0.0.21.","SINAPI",93671,"DISJUNTOR TRIPOLAR TIPO DIN, CORRENTE NOMINAL DE 32A - FORNECIMENTO E INSTALAÇÃO. AF_04/2016","UN",1,null,null,null,"Referência: AGETOP - 71173"]
["S",2,"S",0,4,6,0,0,0,0,0,"F","Serviço","Serviço","4.6.0.0.22.","SINAPI",91844,"ELETRODUTO FLEXÍVEL CORRUGADO, PVC, DN 25 MM (3/4\"), PARA CIRCUITOS TERMINAIS, INSTALADO EM LAJE - FORNECIMENTO E INSTALAÇÃO. AF_12/2015","M",15,null,null,null,""]
["S",2,"S",0,4,6,0,0,0,0,0,"F","Serviço","Serviço","4.6.0.0.23.","SINAPI",91872,"ELETRODUTO RÍGIDO ROSCÁVEL, PVC, DN 32 MM (1\"), PARA CIRCUITOS TERMINAIS, INSTALADO EM PAREDE - FORNECIMENTO E INSTALAÇÃO. AF_12/2015","M",130,null,null,null,"Referência: AGETOP - 71202"]
["S",2,"S",0,4,6,0,0,0,0,0,"F","Serviço","Serviço","4.6.0.0.24.","AGETOP",71450,"INTERRUPTOR DIFERENCIAL RESIDUAL (D.R.) BIPOLAR DE 25A-30mA","Un    ",1,null,null,null,""]
["S",2,"S",0,4,6,0,0,0,0,0,"F","Serviço","Serviço","4.6.0.0.25.","AGETOP",71872,"PARAFUSO SEXTAVADO  CABEÇA LENTILHA D = 1/4\" X 5/8\"","Un    ",50,null,null,null,""]
["S",2,"S",0,4,6,0,0,0,0,0,"F","Serviço","Serviço","4.6.0.0.26.","SINAPI",91885,"LUVA PARA ELETRODUTO, PVC, ROSCÁVEL, DN 32 MM (1\"), PARA CIRCUITOS TERMINAIS, INSTALADA EM PAREDE - FORNECIMENTO E INSTALAÇÃO. AF_12/2015","UN",65,null,null,null,"Referência: AGETOP - 71742"]
["S",2,"S",0,4,6,0,0,0,0,0,"F","Serviço","Serviço","4.6.0.0.27.","SINAPI",91996,"TOMADA MÉDIA DE EMBUTIR (1 MÓDULO), 2P+T 10 A, INCLUINDO SUPORTE E PLACA - FORNECIMENTO E INSTALAÇÃO. AF_12/2015","UN",4,null,null,null,"Referência: AGETOP - 72578"]
[2,2,2,7,4,7,0,0,0,39,7,"F","Nível 2","Nível 2","4.7.","AGETOP",91045,"ALVENARIAS E DIVISÓRIAS","Un    ",null,null,null,null,""]
[3,3,3,2,4,7,1,0,0,6,2,"F","Nível 3","Nível 3","4.7.1.","SINAPI",null,"ARQUIBANCADA","-",null,null,null,null,""]
["S",3,"S",0,4,7,1,0,0,0,0,"F","Serviço","Serviço","4.7.1.0.1.","SINAPI",72132,"ALVENARIA EM TIJOLO CERAMICO MACICO 5X10X20CM 1/2 VEZ (ESPESSURA 10CM), ASSENTADO COM ARGAMASSA TRACO 1:2:8 (CIMENTO, CAL E AREIA)","M2",60.94,null,null,null,""]
[3,3,3,2,4,7,2,0,0,4,2,"F","Nível 3","Nível 3","4.7.2.","SINAPI",null,"MURETA","-",null,null,null,null,""]
["S",3,"S",0,4,7,2,0,0,0,0,"F","Serviço","Serviço","4.7.2.0.1.","SINAPI",87503,"ALVENARIA DE VEDAÇÃO DE BLOCOS CERÂMICOS FURADOS NA HORIZONTAL DE 9X19X19CM (ESPESSURA 9CM) DE PAREDES COM ÁREA LÍQUIDA MAIOR OU IGUAL A 6M² SEM VÃOS E ARGAMASSA DE ASSENTAMENTO COM PREPARO EM BETONEIRA. AF_06/2014","M2",72.45,null,null,null,"Referência: AGETOP - 100201"]
[3,3,3,2,4,7,3,0,0,2,19,"F","Nível 3","Nível 3","4.7.3.","SINAPI",null,"ELEMENTOS VAZADOS","-",null,null,null,null,""]
["S",3,"S",0,4,7,3,0,0,0,0,"F","Serviço","Serviço","4.7.3.0.1.","AGETOP",100501,"ELEMENTO VAZADO DE CONCRETO","m2    ",99.179999999999993,null,null,null,""]
[2,2,2,2,4,8,0,0,0,32,2,"F","Nível 2","Nível 2","4.8.",null,null,"IMPERMEABILIZAÇÃO","-",null,null,null,null,""]
["S",2,"S",0,4,8,0,0,0,0,0,"F","Serviço","Serviço","4.8.0.0.1.","SINAPI",98562,"IMPERMEABILIZAÇÃO DE FLOREIRA OU VIGA BALDRAME COM ARGAMASSA DE CIMENTO E AREIA, COM ADITIVO IMPERMEABILIZANTE, E = 2 CM. AF_06/2018","M2",118.16666666666666,null,null,null,"Referência: AGETOP - 120902"]
[2,2,2,2,4,9,0,0,0,30,2,"F","Nível 2","Nível 2","4.9.",null,null,"ESTRUTURAS METÁLICAS","-",null,null,null,null,""]
["S",2,"S",0,4,9,0,0,0,0,0,"F","Serviço","Serviço","4.9.0.0.1.","AGETOP",150103,"ESTRUTURA METÁLICA CONVENCIONAL EM AÇO DO TIPO USI SAC-300 COM FUNDO ANTICORROSIVO","Kg    ",7150,null,null,null,""]
[{"$f":"CHOOSE(1+LOG(1+2*(ORÇAMENTO.Nivel=\"Nível 1\")+4*(ORÇAMENTO.Nivel=\"Nível 2\")+8*(ORÇAMENTO.Nivel=\"Nível 3\")+16*(ORÇAMENTO.Nivel=\"Nível 4\")+32*(ORÇAMENTO.Nivel=\"Serviço\"),2),0,1,2,3,4,\"S\")","v":2},2,2,2,4,10,0,0,0,28,2,"F","Nível 2","Nível 2","4.10.",null,null,"COBERTURAS","-",null,null,null,null,""]
["S",2,"S",0,4,10,0,0,0,0,0,"F","Serviço","Serviço","4.10.0.0.1.","AGETOP",160969,"COBERTURA COM TELHA CHAPA GALVANIZADA TRAPEZOIDAL 0,43 MM COM ACESSÓRIOS","m2    ",817.3264999999999,null,null,null,""]
[2,2,2,3,4,11,0,0,0,26,3,"F","Nível 2","Nível 2","4.11.",null,null,"REVESTIMENTO DE PAREDE","-",null,null,null,null,""]
["S",2,"S",0,4,11,0,0,0,0,0,"F","Serviço","Serviço","4.11.0.0.1.","SINAPI",87904,"CHAPISCO APLICADO EM ALVENARIA (COM PRESENÇA DE VÃOS) E ESTRUTURAS DE CONCRETO DE FACHADA, COM COLHER DE PEDREIRO.  ARGAMASSA TRAÇO 1:3 COM PREPARO MANUAL. AF_06/2014","M2",179.83799999999999,null,null,null,"Referência: AGETOP - 200101"]
["S",2,"S",0,4,11,0,0,0,0,0,"F","Serviço","Serviço","4.11.0.0.2.","SINAPI",87547,"MASSA ÚNICA, PARA RECEBIMENTO DE PINTURA, EM ARGAMASSA TRAÇO 1:2:8, PREPARO MECÂNICO COM BETONEIRA 400L, APLICADA MANUALMENTE EM FACES INTERNAS DE PAREDES, ESPESSURA DE 10MM, COM EXECUÇÃO DE TALISCAS. AF_06/2014","M2",179.83799999999999,null,null,null,""]
[2,2,2,10,4,12,0,0,0,23,10,"F","Nível 2","Nível 2","4.12.",null,null,"REVESTIMENTO DE PISO","-",null,null,null,null,""]
[3,3,3,2,4,12,1,0,0,9,2,"F","Nível 3","Nível 3","4.12.1.",null,null,"LAMINADO","-",null,null,null,null,""]
["S",3,"S",0,4,12,1,0,0,0,0,"F","Serviço","Serviço","4.12.1.0.1.","AGETOP",220061,"PISO LAMINADO COM CONCRETO USINADO 20MPA E=7 CM  ","m2    ",560.23,null,null,null,""]
[3,3,3,3,4,12,2,0,0,7,3,"F","Nível 3","Nível 3","4.12.2.","SINAPI",null,"JUNTA DE DILATAÇÃO","-",null,null,null,null,""]
["S",3,"S",0,4,12,2,0,0,0,0,"F","Serviço","Serviço","4.12.2.0.1.","SINAPI",68328,"JUNTA DE DILATACAO COM ISOPOR 10 MM","M2",6.3765000000000001,null,null,null,""]
["S",3,"S",0,4,12,2,0,0,0,0,"F","Serviço","Serviço","4.12.2.0.2.","AGETOP",120210,"MASTIQUE A BASE DE POLIURETANO COM PRÉVIO PREPARO E TRATAMENTO DA SUPERFÍCIE","CM3   ",9810,null,null,null,""]
[3,3,3,2,4,12,3,0,0,4,2,"F","Nível 3","Nível 3","4.12.3.","SINAPI",null,"ARQUIBANCADA","-",null,null,null,null,""]
["S",3,"S",0,4,12,3,0,0,0,0,"F","Serviço","Serviço","4.12.3.0.1.","AGETOP",220102,"PISO CONCRETO DESEMPENADO ESPESSURA = 5 CM  1:2,5:3,5","m2    ",36.409999999999997,null,null,null,""]
[3,3,3,2,4,12,4,0,0,2,{"$error":"#N/A"},"F","Nível 3","Nível 3","4.12.4.",null,null,"PASSEIO (CALÇADA)","-",null,null,null,null,""]
["S",3,"S",0,4,12,4,0,0,0,0,"F","Serviço","Serviço","4.12.4.0.1.","AGETOP",220100,"PASSEIO PROTECAO EM CONC.DESEMPEN.5 CM 1:2,5:3,5 ( INCLUSO ESPELHO DE 30CM/ESCAVAÇÃO/REATERRO/APILOAMENTO/ATERRO INTERNO)","m2    ",91.24,null,null,null,""]
[2,2,2,6,4,13,0,0,0,13,6,"F","Nível 2","Nível 2","4.13.",null,null,"PINTURA","-",null,null,null,null,""]
[3,3,3,3,4,13,1,0,0,5,3,"F","Nível 3","Nível 3","4.13.1.",null,null,"MURETA","-",null,null,null,null,""]
["S",3,"S",0,4,13,1,0,0,0,0,"F","Serviço","Serviço","4.13.1.0.1.","AGETOP",261304,"EMASSAMENTO ACRILICO 2 DEMAOS","m2    ",179.83799999999999,null,null,null,""]
["S",3,"S",0,4,13,1,0,0,0,0,"F","Serviço","Serviço","4.13.1.0.2.","AGETOP",200499,"REBOCO PAULISTA A-14 (1CALH:4ARMLC+100kgCI/M3)","m2    ",179.83799999999999,null,null,null,""]
[3,3,3,2,4,13,2,0,0,2,{"$error":"#N/A"},"F","Nível 3","Nível 3","4.13.2.","AGETOP",261609,"QUADRA DE ESPORTES","m2    ",null,null,null,null,""]
["S",3,"S",0,4,13,2,0,0,0,0,"F","Serviço","Serviço","4.13.2.0.1.","AGETOP",261609,"PINTURA ESMALTE ALQUIDICO ESTR.METALICA 2 DEMAOS","m2    ",817.3264999999999,null,null,null,""]
[2,2,2,7,4,14,0,0,0,{"$f":"IF(OR($C921=\"S\",$C921=0),0,MATCH(0,OFFSET($D921,1,$C921,ROW($C$928)-ROW($C921)),0))","v":7},{"$f":"IF(OR($C921=\"S\",$C921=0),0,MATCH(OFFSET($D921,0,$C921)+1,OFFSET($D921,1,$C921,ROW($C$928)-ROW($C921)),0))","v":{"$error":"#N/A"}},"F","Nível 2","Nível 2","4.14.",null,null,"DIVERSOS","-",null,null,null,null,""]
["S",2,"S",0,4,14,0,0,0,0,0,"F","Serviço","Serviço","4.14.0.0.1.","AGETOP",270501,"LIMPEZA FINAL DE OBRA - (OBRAS CIVIS)","m2    ",687.44,null,null,null,""]
["S",2,"S",0,4,14,0,0,0,0,0,"F","Serviço","Serviço","4.14.0.0.2.","SINAPI","74244/1","ALAMBRADO PARA QUADRA POLIESPORTIVA, ESTRUTURADO POR TUBOS DE ACO GALVANIZADO, COM COSTURA, DIN 2440, DIAMETRO 2\", COM TELA DE ARAME GALVANIZADO, FIO 14 BWG E MALHA QUADRADA 5X5CM","M2",140.80000000000001,null,null,null,"Referência: AGETOP - 270621"]
["S",2,"S",0,4,14,0,0,0,0,0,"F","Serviço","Serviço","4.14.0.0.3.","AGETOP",271103,"CONJUNTO PARA VOLEIBOL EM FERRO GALVANIZADO COM PINTURA (2 SUPORTES)","CJ    ",1,null,null,null,""]
["S",2,"S",0,4,14,0,0,0,0,0,"F","Serviço","Serviço","4.14.0.0.4.","AGETOP",271101,"TRAVES FERRO GALVANIZADO PARA FUTEBOL DE SALÃO PINTADAS - 3,00 x 2,00M - 2 UNID.","CJ    ",1,null,null,null,""]
["S",2,"S",0,4,14,0,0,0,0,0,"F","Serviço","Serviço","4.14.0.0.5.","AGETOP",270889,"SUPORTE PADRÃO PARA TABELA BASQUETE EM \"U\" ENRIJECIDO- 2 UNID. (ASSENTADOS/PINTADOS)","CJ    ",1,null,null,null,""]
["S",2,"S",0,4,14,0,0,0,0,0,"F","Serviço","Serviço","4.14.0.0.6.","AGETOP",271099,"TABELA PARA BASQUETE ESTRUTURA METÁLICA E COMPENSADO (ASSENT./PINTADAS) ARO METÁLICO - 2 UNID.","CJ    ",1,null,null,null,""]
[-1,null,-1,null,0,0,0,0,0,null,null,"F"]
[null,null,null,null,null,null,null,null,null,null,null,"F",null,null,null,null,null,"OBS: OS QUANTITATIVOS DE MATERIAIS  DAS INSTALAÇÕES HIDROSSANITÁRIAS, ELÉTRICAS E ESPECIAIS SÃO FORNECIDOS PELOS PROFISSIONAIS RESPONSÁVEIS PELOS RESPECTIVOS PROJETOS.",null,null,"VALOR TOTAL"]
[null,null,null,null,null,null,null,null,null,null,null,"F",null,null,null,null,null,null,null,null,"VALOR BDI (26,43%)"]
[null,null,null,null,null,null,null,null,null,null,null,"F",null,null,null,null,null,null,null,null,"TOTAL ORÇAMENTO"]
[null,null,null,null,null,null,null,null,null,null,null,"F"]
[null,null,null,null,null,null,null,null,null,null,null,"F",null,null,null,null,null,null,null,null,"CUSTO POR M2 ³"]
[null,null,null,null,null,null,null,null,null,null,null,"F",null,null,null,null,null,null,null,null,"MATERIAL S/ BDI"]
[null,null,null,null,null,null,null,null,null,null,null,"F",null,null,null,null,null,null,null,null,"MÃO DE OBRA S/ BDI"]
[null,null,null,null,null,null,null,null,null,null,null,"F"]
[null,null,null,null,null,null,null,null,null,null,null,"F",null,null,null,null,"(1) Conforme previsto pelo DECRETO Nº 7.983, DE 8 DE ABRIL DE 2013, os preços adotados são aqueles constantes dos sistemas de referência indicados. Justifica-se o uso dos preços destas composições de custos unitários devido ao seu valor ser menor à mediana de seus correspondentes na tabela SINAPI;"]
[null,null,null,null,null,null,null,null,null,null,null,"F",null,null,null,null,"(2) Optou-se pelo uso das composições de custos da AGETOP para itens não presentes na SINAPI;"]
[null,null,null,null,null,null,null,null,null,null,null,"F",null,null,null,null,"(3) Para itens da AGETOP, os vidros não estão inclusos nas esquadrias e já foram considerados os custos de contramarco para as esquadrias de alumínio;"]
[null,null,null,null,null,null,null,null,null,null,null,"F",null,null,null,null,"(4) Nos casos em que houver execução de granitina e omissão do item AGETOP 221102, considerou-se que o quantitativo para o rodapé, de altura igual a 7cm, foi incorporado na área de piso;"]
[null,null,null,null,null,null,null,null,null,null,null,"F",null,null,null,null,"(5) O custo unitário aproximado por metro quadrado é calculado dividindo-se o valor total do orçamento pela área total de construção."]
[null,null,null,null,null,null,null,null,null,null,null,"F"]
[null,null,null,null,null,null,null,null,null,null,null,"F"]
[]
[null,null,null,null,null,null,null,null,null,null,null,null,null,null,"SOMATÓRIO DE SERVIÇOS"]
[null,null,null,null,null,null,null,null,null,null,null,null,null,null,"ITEM","DESCRIÇÃO DOS SERVIÇOS",null,null,"PREÇO SEM BDI",null,null,"PREÇO COM BDI",null,"PARTICIPAÇÃO ( % )"]
[null,null,null,null,null,null,null,null,null,null,null,null,null,null,"a.","SERVIÇOS PRELIMINARES",null,null,{"$f":"SUMIF($R$19:$R$928,$P947,$W$19:$W$928)","v":0},null,null,{"$f":"ROUND(S947*(1+BDI.Taxa),2)","v":0},null,{"$f":"IFERROR(ROUND($V947*100/$W$931,2),0)","v":0}]
[null,null,null,null,null,null,null,null,null,null,null,null,null,null,"b.","TRANSPORTES",null,null,0,null,null,0,null,{"$f":"IFERROR(ROUND($V948*100/$W$931,2),0)","v":0}]
[null,null,null,null,null,null,null,null,null,null,null,null,null,null,"c.","SERVIÇO EM TERRA",null,null,0,null,null,0,null,0]
[null,null,null,null,null,null,null,null,null,null,null,null,null,null,"d.","FUNDAÇÕES E SONDAGENS",null,null,0,null,null,0,null,0]
[null,null,null,null,null,null,null,null,null,null,null,null,null,null,"e.","ESTRUTURA",null,null,0,null,null,0,null,0]
[null,null,null,null,null,null,null,null,null,null,null,null,null,null,"f.","INSTALAÇÕES ELÉTRICAS",null,null,0,null,null,0,null,0]
[null,null,null,null,null,null,null,null,null,null,null,null,null,null,"g.","INSTALAÇÕES HIDROSSANITÁRIAS",null,null,0,null,null,0,null,0]
[null,null,null,null,null,null,null,null,null,null,null,null,null,null,"h","INSTALAÇÕES ESPECIAIS",null,null,0,null,null,0,null,0]
[null,null,null,null,null,null,null,null,null,null,null,null,null,null,"i.","ALVENARIAS E DIVISÓRIAS",null,null,0,null,null,0,null,0]
[null,null,null,null,null,null,null,null,null,null,null,null,null,null,"j.","ALVENARIA AUTO-PORTANTE",null,null,0,null,null,0,null,0]
[null,null,null,null,null,null,null,null,null,null,null,null,null,null,"k.","IMPERMEABILIZAÇÃO",null,null,0,null,null,0,null,0]
[null,null,null,null,null,null,null,null,null,null,null,null,null,null,"l.","ISOLAMENTO TÉRMICO E ACÚSTICO",null,null,0,null,null,0,null,0]
[null,null,null,null,null,null,null,null,null,null,null,null,null,null,"m.","ESTRUTURA DE MADEIRA",null,null,0,null,null,0,null,0]
[null,null,null,null,null,null,null,null,null,null,null,null,null,null,"n.","ESTRUTURAS METÁLICAS",null,null,0,null,null,0,null,0]
[null,null,null,null,null,null,null,null,null,null,null,null,null,null,"o.","COBERTURAS",null,null,0,null,null,0,null,0]
[null,null,null,null,null,null,null,null,null,null,null,null,null,null,"p.","ESQUADRIAS DE MADEIRA",null,null,0,null,null,0,null,0]
[null,null,null,null,null,null,null,null,null,null,null,null,null,null,"q.","ESQUADRIAS METÁLICAS",null,null,0,null,null,{"$f":"ROUND(S963*(1+BDI.Taxa),2)","v":0},null,0]
[null,null,null,null,null,null,null,null,null,null,null,null,null,null,"r.","VIDROS",null,null,0,null,null,0,null,0]
[null,null,null,null,null,null,null,null,null,null,null,null,null,null,"s.","REVESTIMENTO DE PAREDE",null,null,0,null,null,0,null,0]
[null,null,null,null,null,null,null,null,null,null,null,null,null,null,"t.","FORROS",null,null,0,null,null,0,null,0]
[null,null,null,null,null,null,null,null,null,null,null,null,null,null,"u.","REVESTIMENTO DE PISO",null,null,0,null,null,0,null,0]
[null,null,null,null,null,null,null,null,null,null,null,null,null,null,"v.","FERRAGENS",null,null,0,null,null,0,null,0]
[null,null,null,null,null,null,null,null,null,null,null,null,null,null,"w.","MARCENARIA",null,null,0,null,null,0,null,0]
[null,null,null,null,null,null,null,null,null,null,null,null,null,null,"x.","ADMINISTRAÇÃO",null,null,0,null,null,0,null,0]
[null,null,null,null,null,null,null,null,null,null,null,null,null,null,"y.","PINTURA",null,null,0,null,null,{"$f":"ROUND(S971*(1+BDI.Taxa),2)","v":0},null,0]
[null,null,null,null,null,null,null,null,null,null,null,null,null,null,"z.","DIVERSOS",null,null,0,null,null,{"$f":"IF(S972>0,IF((SUM(V947:W971)+ROUND(S972*(1+BDI.Taxa),2))<>V974,V974-SUM(V947:W971),ROUND(S972*(1+BDI.Taxa),2)),0)","v":0},null,{"$f":"IF(S972>0,IF((SUM(X947:X971)+IFERROR(ROUND($V972*100/$W$931,2),0))<>X974,X974-SUM(X947:X971),IFERROR(ROUND($V972*100/$W$931,2),0)),0)","v":0}]
[null,null,null,null,null,null,null,null,null,null,null,null,null,null,"TOTAL GERAL DO ORÇAMENTO (R$)",null,null,null,{"$f":"SUM(S947:U972)","v":0},null,null,{"$f":"SUM(V947:W972)","v":0},null,{"$f":"SUM(X947:X972)","v":0}]
[null,null,null,null,null,null,null,null,null,null,null,null,null,null,null,null,null,null,{"$f":"$W$929","v":0},null,null,{"$f":"$W$931","v":0},null,100]
[null,null,null,null,null,null,null,null,null,null,null,null,null,null,null,null,null,null,"(TOTAL SEM BDI)",null,null,"(TOTAL COM BDI)",null,"(ARRED porcentagem)"]
[null,null,null,null,null,null,null,null,null,null,null,null,null,null,null,null,null,null,{"$f":"IF(AND(S973=S974,S973>0),\"OK\",\"ERRO\")","v":"ERRO"},null,null,{"$f":"IF(AND(V973=V974,V973>0),\"OK\",\"ERRO\")","v":"ERRO"},null,{"$f":"IF(X973=100,\"OK\",\"ERRO\")","v":"ERRO"}]
[]
[]
[null,null,null,null,null,null,null,null,null,null,null,null,null,null,"RESUMO GERAL DO ORÇAMENTO"]
[null,null,null,null,null,null,null,null,null,null,null,null,null,null,"ITEM","DESCRIÇÃO DOS SERVIÇOS",null,null,"PREÇO SEM BDI",null,null,"PREÇO COM BDI",null,"PARTICIPAÇÃO ( % )"]
[null,null,null,null,null,null,null,null,null,null,null,null,null,null,"1.",{"$f":"IFERROR(VLOOKUP(O981,$O$19:$W$928,4,FALSE),\"\")","v":"REFORMA"},null,null,{"$f":"IF(P982=\"\",$S$1002-SUM(OFFSET($S$980:S980,0,0,COUNTA($S$980:S980),1)),SUMIF($R$19:$R$928,$P981,$W$19:$W$928))","v":0},null,null,{"$f":"IF(P982=\"\",$V$1002-SUM(OFFSET($V$980:V980,0,0,COUNTA($V$980:V980),1)),ROUND(S981*(1+BDI.Taxa),2))","v":0},null,{"$f":"IF(P982=\"\",$X$1002-SUM(OFFSET($X$980:X980,0,0,COUNTA($X$980:X980),1)),ROUND(V981*100/ORÇAMENTO.Totalorçamento,2))","v":{"$error":"#DIV/0!"}}]
[null,null,null,null,null,null,null,null,null,null,null,null,null,null,"2.","PASSARELA PADRÃO SÉC. XXI 2015 - MOD 01",null,null,{"$f":"IF(P983=\"\",$S$1002-SUM(OFFSET($S$980:S981,0,0,COUNTA($S$980:S981),1)),SUMIF($R$19:$R$928,$P982,$W$19:$W$928))","v":0},null,null,{"$f":"IF(P983=\"\",$V$1002-SUM(OFFSET($V$980:V981,0,0,COUNTA($V$980:V981),1)),ROUND(S982*(1+BDI.Taxa),2))","v":0},null,{"$f":"IF(P983=\"\",$X$1002-SUM(OFFSET($X$980:X981,0,0,COUNTA($X$980:X981),1)),ROUND(V982*100/ORÇAMENTO.Totalorçamento,2))","v":{"$error":"#DIV/0!"}}]
[null,null,null,null,null,null,null,null,null,null,null,null,null,null,"3.","BLOCO 02 SALAS DE AULA PADRÃO SEDUC - 2017 - LAJE",null,null,{"$f":"IF(P984=\"\",$S$1002-SUM(OFFSET($S$980:S982,0,0,COUNTA($S$980:S982),1)),SUMIF($R$19:$R$928,$P983,$W$19:$W$928))","v":0},null,null,{"$f":"IF(P984=\"\",$V$1002-SUM(OFFSET($V$980:V982,0,0,COUNTA($V$980:V982),1)),ROUND(S983*(1+BDI.Taxa),2))","v":0},null,{"$f":"IF(P984=\"\",$X$1002-SUM(OFFSET($X$980:X982,0,0,COUNTA($X$980:X982),1)),ROUND(V983*100/ORÇAMENTO.Totalorçamento,2))","v":{"$error":"#DIV/0!"}}]
[null,null,null,null,null,null,null,null,null,null,null,null,null,null,"4.","QUADRA EM ARCO PADRÃO SEDUC - MOD 03",null,null,{"$f":"IF(P985=\"\",$S$1002-SUM(OFFSET($S$980:S983,0,0,COUNTA($S$980:S983),1)),SUMIF($R$19:$R$928,$P984,$W$19:$W$928))","v":0},null,null,{"$f":"IF(P985=\"\",$V$1002-SUM(OFFSET($V$980:V983,0,0,COUNTA($V$980:V983),1)),ROUND(S984*(1+BDI.Taxa),2))","v":0},null,{"$f":"IF(P985=\"\",$X$1002-SUM(OFFSET($X$980:X983,0,0,COUNTA($X$980:X983),1)),ROUND(V984*100/ORÇAMENTO.Totalorçamento,2))","v":{"$error":"#DIV/0!"}}]
[null,null,null,null,null,null,null,null,null,null,null,null,null,null,"5.","",null,null,{"$f":"IF(P986=\"\",$S$1002-SUM(OFFSET($S$980:S984,0,0,COUNTA($S$980:S984),1)),SUMIF($R$19:$R$928,$P985,$W$19:$W$928))","v":0},null,null,{"$f":"IF(P986=\"\",$V$1002-SUM(OFFSET($V$980:V984,0,0,COUNTA($V$980:V984),1)),ROUND(S985*(1+BDI.Taxa),2))","v":0},null,{"$f":"IF(P986=\"\",$X$1002-SUM(OFFSET($X$980:X984,0,0,COUNTA($X$980:X984),1)),ROUND(V985*100/ORÇAMENTO.Totalorçamento,2))","v":{"$error":"#DIV/0!"}}]
[null,null,null,null,null,null,null,null,null,null,null,null,null,null,"6.","",null,null,{"$f":"IF(P987=\"\",$S$1002-SUM(OFFSET($S$980:S985,0,0,COUNTA($S$980:S985),1)),SUMIF($R$19:$R$928,$P986,$W$19:$W$928))","v":0},null,null,{"$f":"IF(P987=\"\",$V$1002-SUM(OFFSET($V$980:V985,0,0,COUNTA($V$980:V985),1)),ROUND(S986*(1+BDI.Taxa),2))","v":0},null,{"$f":"IF(P987=\"\",$X$1002-SUM(OFFSET($X$980:X985,0,0,COUNTA($X$980:X985),1)),ROUND(V986*100/ORÇAMENTO.Totalorçamento,2))","v":{"$error":"#DIV/0!"}}]
[null,null,null,null,null,null,null,null,null,null,null,null,null,null,"7.","",null,null,{"$f":"IF(P988=\"\",$S$1002-SUM(OFFSET($S$980:S986,0,0,COUNTA($S$980:S986),1)),SUMIF($R$19:$R$928,$P987,$W$19:$W$928))","v":0},null,null,{"$f":"IF(P988=\"\",$V$1002-SUM(OFFSET($V$980:V986,0,0,COUNTA($V$980:V986),1)),ROUND(S987*(1+BDI.Taxa),2))","v":0},null,{"$f":"IF(P988=\"\",$X$1002-SUM(OFFSET($X$980:X986,0,0,COUNTA($X$980:X986),1)),ROUND(V987*100/ORÇAMENTO.Totalorçamento,2))","v":{"$error":"#DIV/0!"}}]
[null,null,null,null,null,null,null,null,null,null,null,null,null,null,"8.","",null,null,{"$f":"IF(P989=\"\",$S$1002-SUM(OFFSET($S$980:S987,0,0,COUNTA($S$980:S987),1)),SUMIF($R$19:$R$928,$P988,$W$19:$W$928))","v":0},null,null,{"$f":"IF(P989=\"\",$V$1002-SUM(OFFSET($V$980:V987,0,0,COUNTA($V$980:V987),1)),ROUND(S988*(1+BDI.Taxa),2))","v":0},null,{"$f":"IF(P989=\"\",$X$1002-SUM(OFFSET($X$980:X987,0,0,COUNTA($X$980:X987),1)),ROUND(V988*100/ORÇAMENTO.Totalorçamento,2))","v":{"$error":"#DIV/0!"}}]
[null,null,null,null,null,null,null,null,null,null,null,null,null,null,"9.","",null,null,{"$f":"IF(P990=\"\",$S$1002-SUM(OFFSET($S$980:S988,0,0,COUNTA($S$980:S988),1)),SUMIF($R$19:$R$928,$P989,$W$19:$W$928))","v":0},null,null,{"$f":"IF(P990=\"\",$V$1002-SUM(OFFSET($V$980:V988,0,0,COUNTA($V$980:V988),1)),ROUND(S989*(1+BDI.Taxa),2))","v":0},null,{"$f":"IF(P990=\"\",$X$1002-SUM(OFFSET($X$980:X988,0,0,COUNTA($X$980:X988),1)),ROUND(V989*100/ORÇAMENTO.Totalorçamento,2))","v":{"$error":"#DIV/0!"}}]
[null,null,null,null,null,null,null,null,null,null,null,null,null,null,"10.","",null,null,{"$f":"IF(P991=\"\",$S$1002-SUM(OFFSET($S$980:S989,0,0,COUNTA($S$980:S989),1)),SUMIF($R$19:$R$928,$P990,$W$19:$W$928))","v":0},null,null,{"$f":"IF(P991=\"\",$V$1002-SUM(OFFSET($V$980:V989,0,0,COUNTA($V$980:V989),1)),ROUND(S990*(1+BDI.Taxa),2))","v":0},null,{"$f":"IF(P991=\"\",$X$1002-SUM(OFFSET($X$980:X989,0,0,COUNTA($X$980:X989),1)),ROUND(V990*100/ORÇAMENTO.Totalorçamento,2))","v":{"$error":"#DIV/0!"}}]
[null,null,null,null,null,null,null,null,null,null,null,null,null,null,"11.","",null,null,{"$f":"IF(P992=\"\",$S$1002-SUM(OFFSET($S$980:S990,0,0,COUNTA($S$980:S990),1)),SUMIF($R$19:$R$928,$P991,$W$19:$W$928))","v":0},null,null,{"$f":"IF(P992=\"\",$V$1002-SUM(OFFSET($V$980:V990,0,0,COUNTA($V$980:V990),1)),ROUND(S991*(1+BDI.Taxa),2))","v":0},null,{"$f":"IF(P992=\"\",$X$1002-SUM(OFFSET($X$980:X990,0,0,COUNTA($X$980:X990),1)),ROUND(V991*100/ORÇAMENTO.Totalorçamento,2))","v":{"$error":"#DIV/0!"}}]
[null,null,null,null,null,null,null,null,null,null,null,null,null,null,"12.","",null,null,{"$f":"IF(P993=\"\",$S$1002-SUM(OFFSET($S$980:S991,0,0,COUNTA($S$980:S991),1)),SUMIF($R$19:$R$928,$P992,$W$19:$W$928))","v":0},null,null,{"$f":"IF(P993=\"\",$V$1002-SUM(OFFSET($V$980:V991,0,0,COUNTA($V$980:V991),1)),ROUND(S992*(1+BDI.Taxa),2))","v":0},null,{"$f":"IF(P993=\"\",$X$1002-SUM(OFFSET($X$980:X991,0,0,COUNTA($X$980:X991),1)),ROUND(V992*100/ORÇAMENTO.Totalorçamento,2))","v":{"$error":"#DIV/0!"}}]
[null,null,null,null,null,null,null,null,null,null,null,null,null,null,"13.","",null,null,{"$f":"IF(P994=\"\",$S$1002-SUM(OFFSET($S$980:S992,0,0,COUNTA($S$980:S992),1)),SUMIF($R$19:$R$928,$P993,$W$19:$W$928))","v":0},null,null,{"$f":"IF(P994=\"\",$V$1002-SUM(OFFSET($V$980:V992,0,0,COUNTA($V$980:V992),1)),ROUND(S993*(1+BDI.Taxa),2))","v":0},null,{"$f":"IF(P994=\"\",$X$1002-SUM(OFFSET($X$980:X992,0,0,COUNTA($X$980:X992),1)),ROUND(V993*100/ORÇAMENTO.Totalorçamento,2))","v":{"$error":"#DIV/0!"}}]
[null,null,null,null,null,null,null,null,null,null,null,null,null,null,"14.","",null,null,{"$f":"IF(P995=\"\",$S$1002-SUM(OFFSET($S$980:S993,0,0,COUNTA($S$980:S993),1)),SUMIF($R$19:$R$928,$P994,$W$19:$W$928))","v":0},null,null,{"$f":"IF(P995=\"\",$V$1002-SUM(OFFSET($V$980:V993,0,0,COUNTA($V$980:V993),1)),ROUND(S994*(1+BDI.Taxa),2))","v":0},null,{"$f":"IF(P995=\"\",$X$1002-SUM(OFFSET($X$980:X993,0,0,COUNTA($X$980:X993),1)),ROUND(V994*100/ORÇAMENTO.Totalorçamento,2))","v":{"$error":"#DIV/0!"}}]
[null,null,null,null,null,null,null,null,null,null,null,null,null,null,"15.","",null,null,{"$f":"IF(P996=\"\",$S$1002-SUM(OFFSET($S$980:S994,0,0,COUNTA($S$980:S994),1)),SUMIF($R$19:$R$928,$P995,$W$19:$W$928))","v":0},null,null,{"$f":"IF(P996=\"\",$V$1002-SUM(OFFSET($V$980:V994,0,0,COUNTA($V$980:V994),1)),ROUND(S995*(1+BDI.Taxa),2))","v":0},null,{"$f":"IF(P996=\"\",$X$1002-SUM(OFFSET($X$980:X994,0,0,COUNTA($X$980:X994),1)),ROUND(V995*100/ORÇAMENTO.Totalorçamento,2))","v":{"$error":"#DIV/0!"}}]
[null,null,null,null,null,null,null,null,null,null,null,null,null,null,"16.","",null,null,{"$f":"IF(P997=\"\",$S$1002-SUM(OFFSET($S$980:S995,0,0,COUNTA($S$980:S995),1)),SUMIF($R$19:$R$928,$P996,$W$19:$W$928))","v":0},null,null,{"$f":"IF(P997=\"\",$V$1002-SUM(OFFSET($V$980:V995,0,0,COUNTA($V$980:V995),1)),ROUND(S996*(1+BDI.Taxa),2))","v":0},null,{"$f":"IF(P997=\"\",$X$1002-SUM(OFFSET($X$980:X995,0,0,COUNTA($X$980:X995),1)),ROUND(V996*100/ORÇAMENTO.Totalorçamento,2))","v":{"$error":"#DIV/0!"}}]
[null,null,null,null,null,null,null,null,null,null,null,null,null,null,"17.","",null,null,{"$f":"IF(P998=\"\",$S$1002-SUM(OFFSET($S$980:S996,0,0,COUNTA($S$980:S996),1)),SUMIF($R$19:$R$928,$P997,$W$19:$W$928))","v":0},null,null,{"$f":"IF(P998=\"\",$V$1002-SUM(OFFSET($V$980:V996,0,0,COUNTA($V$980:V996),1)),ROUND(S997*(1+BDI.Taxa),2))","v":0},null,{"$f":"IF(P998=\"\",$X$1002-SUM(OFFSET($X$980:X996,0,0,COUNTA($X$980:X996),1)),ROUND(V997*100/ORÇAMENTO.Totalorçamento,2))","v":{"$error":"#DIV/0!"}}]
[null,null,null,null,null,null,null,null,null,null,null,null,null,null,"18.","",null,null,{"$f":"IF(P999=\"\",$S$1002-SUM(OFFSET($S$980:S997,0,0,COUNTA($S$980:S997),1)),SUMIF($R$19:$R$928,$P998,$W$19:$W$928))","v":0},null,null,{"$f":"IF(P999=\"\",$V$1002-SUM(OFFSET($V$980:V997,0,0,COUNTA($V$980:V997),1)),ROUND(S998*(1+BDI.Taxa),2))","v":0},null,{"$f":"IF(P999=\"\",$X$1002-SUM(OFFSET($X$980:X997,0,0,COUNTA($X$980:X997),1)),ROUND(V998*100/ORÇAMENTO.Totalorçamento,2))","v":{"$error":"#DIV/0!"}}]
[null,null,null,null,null,null,null,null,null,null,null,null,null,null,"19.","",null,null,{"$f":"IF(P1000=\"\",$S$1002-SUM(OFFSET($S$980:S998,0,0,COUNTA($S$980:S998),1)),SUMIF($R$19:$R$928,$P999,$W$19:$W$928))","v":0},null,null,{"$f":"IF(P1000=\"\",$V$1002-SUM(OFFSET($V$980:V998,0,0,COUNTA($V$980:V998),1)),ROUND(S999*(1+BDI.Taxa),2))","v":0},null,{"$f":"IF(P1000=\"\",$X$1002-SUM(OFFSET($X$980:X998,0,0,COUNTA($X$980:X998),1)),ROUND(V999*100/ORÇAMENTO.Totalorçamento,2))","v":{"$error":"#DIV/0!"}}]
[null,null,null,null,null,null,null,null,null,null,null,null,null,null,"20.","",null,null,{"$f":"IF(P1001=\"\",$S$1002-SUM(OFFSET($S$980:S999,0,0,COUNTA($S$980:S999),1)),SUMIF($R$19:$R$928,$P1000,$W$19:$W$928))","v":0},null,null,{"$f":"IF(P1001=\"\",$V$1002-SUM(OFFSET($V$980:V999,0,0,COUNTA($V$980:V999),1)),ROUND(S1000*(1+BDI.Taxa),2))","v":0},null,{"$f":"IF(P1001=\"\",$X$1002-SUM(OFFSET($X$980:X999,0,0,COUNTA($X$980:X999),1)),ROUND(V1000*100/ORÇAMENTO.Totalorçamento,2))","v":{"$error":"#DIV/0!"}}]
[null,null,null,null,null,null,null,null,null,null,null,null,null,null,"TOTAL GERAL DO ORÇAMENTO (R$)",null,null,null,{"$f":"SUM(S981:U1000)","v":0},null,null,{"$f":"SUM(V981:W1000)","v":0},null,{"$f":"SUM(X981:X1000)","v":{"$error":"#DIV/0!"}}]
[null,null,null,null,null,null,null,null,null,null,null,null,null,null,null,null,null,null,{"$f":"$W$929","v":0},null,null,{"$f":"$W$931","v":0},null,100]
[null,null,null,null,null,null,null,null,null,null,null,null,null,null,null,null,null,null,"(TOTAL SEM BDI)",null,null,"(TOTAL COM BDI)",null,"(ARRED porcentagem)"]
[null,null,null,null,null,null,null,null,null,null,null,null,null,null,null,null,null,null,{"$f":"IF(AND(S1001=S1002,S1001>0),\"OK\",\"ERRO\")","v":"ERRO"},null,null,{"$f":"IF(AND(V1001=V1002,V1001>0),\"OK\",\"ERRO\")","v":"ERRO"},null,{"$f":"IF(AND(X1001=100,S981<>0),\"OK\",\"ERRO\")","v":{"$error":"#DIV/0!"}}]

{"sheet":"Resumo ","index":1,"n_rows":39,"n_cols":9,"rows_kept":39,"cut":false,"hidden":false,"merged":[[13,0,14,0],[34,2,34,3],[35,2,35,3],[31,2,31,3],[32,2,32,3],[33,2,33,3],[28,2,28,3],[29,2,29,3],[30,2,30,3],[0,1,0,8],[36,1,36,5],[2,1,2,5],[3,1,3,5],[5,1,5,5],[6,1,6,5],[8,1,8,5],[9,1,9,5],[11,3,11,5],[12,3,12,5],[10,1,10,8],[11,6,11,8],[12,6,12,8],[25,2,25,3],[21,2,21,3],[22,2,22,3],[6,6,6,8],[7,1,7,8],[8,6,8,8],[9,6,9,8],[13,1,13,8],[1,1,1,8],[2,6,2,8],[3,6,3,8],[4,1,4,8],[5,6,5,8],[42,3,42,7],[11,1,11,2],[12,1,12,2],[15,2,15,3],[16,2,16,3],[14,1,14,8],[17,2,17,3],[23,2,23,3],[18,2,18,3],[19,2,19,3],[20,2,20,3],[41,3,41,7],[24,2,24,3],[26,2,26,3],[27,2,27,3],[38,1,38,8]]}
[]
[]
[null,"UNIDADE ESCOLAR",null,null,null,null,"CÓDIGO INEP"]
[null,{"$f":"Orçamento!$O$4","v":"CENTRO DE ENSINO EM PERÍODO INTEGRAL SYLVIO DE MELLO"},null,null,null,null,{"$f":"Orçamento!V4","v":52069206}]
[]
[null,"OBRA",null,null,null,null,"CIDADE"]
[null,{"$f":"Orçamento!$O$7","v":"REFORMA"},null,null,null,null,{"$f":"Orçamento!$V$7","v":"MORRINHOS"}]
[]
[null,"ENDEREÇO",null,null,null,null,"CRE"]
[null,{"$f":"Orçamento!$R$10","v":"RUA PIAUI 386, CENTRO, CEP:75650-000"},null,null,null,null,{"$f":"Orçamento!$O$10","v":"MORRINHOS"}]
[]
[null,"REFERÊNCIA",null,"DATA",null,null,"ÁREA TOTAL CONSTRUÍDA (M²)"]
[null,{"$f":"CONCATENATE(\"AGETOP E SINAPI - \",Orçamento!$T$10)","v":"AGETOP E SINAPI - DESONERADA"},null,{"$f":"Orçamento!$S$7","v":"2020-07-07"},null,null,{"$f":"Orçamento!$V$13","v":3042.44}]
["FILTRO"]
[null,"RESUMO GERAL DO ORÇAMENTO"]
["↓","ITEM","DESCRIÇÃO DOS SERVIÇOS",null,"UNID","QUANT","PREÇO SEM BDI","PREÇO COM BDI","PARTICIP. (%)"]
[{"$f":"IF(H17>0,\"F\",\"\")","v":""},"1.",{"$f":"Orçamento!$P981","v":"REFORMA"},null,{"$f":"IF(C17<>\"\",\"UN\",\"\")","v":"UN"},{"$f":"IF(C17<>\"\",1,\"\")","v":1},{"$f":"IFERROR(Orçamento!S981,\"-\")","v":0},{"$f":"IFERROR(Orçamento!V981,\"\")","v":0},{"$f":"Orçamento!X981","v":{"$error":"#DIV/0!"}}]
[{"$f":"IF(H18>0,\"F\",\"\")","v":""},"2.",{"$f":"Orçamento!$P982","v":"PASSARELA PADRÃO SÉC. XXI 2015 - MOD 01"},null,{"$f":"IF(C18<>\"\",\"UN\",\"\")","v":"UN"},{"$f":"IF(C18<>\"\",1,\"\")","v":1},{"$f":"IFERROR(Orçamento!S982,\"-\")","v":0},{"$f":"IFERROR(Orçamento!V982,\"\")","v":0},{"$f":"Orçamento!X982","v":{"$error":"#DIV/0!"}}]
[{"$f":"IF(H19>0,\"F\",\"\")","v":""},"3.",{"$f":"Orçamento!$P983","v":"BLOCO 02 SALAS DE AULA PADRÃO SEDUC - 2017 - LAJE"},null,"UN",1,{"$f":"IFERROR(Orçamento!S983,\"-\")","v":0},{"$f":"IFERROR(Orçamento!V983,\"\")","v":0},{"$f":"Orçamento!X983","v":{"$error":"#DIV/0!"}}]
["","4.",{"$f":"Orçamento!$P984","v":"QUADRA EM ARCO PADRÃO SEDUC - MOD 03"},null,"UN",1,{"$f":"IFERROR(Orçamento!S984,\"-\")","v":0},{"$f":"IFERROR(Orçamento!V984,\"\")","v":0},{"$f":"Orçamento!X984","v":{"$error":"#DIV/0!"}}]
["","5.",{"$f":"Orçamento!$P985","v":""},null,"","",{"$f":"IFERROR(Orçamento!S985,\"-\")","v":0},{"$f":"IFERROR(Orçamento!V985,\"\")","v":0},{"$f":"Orçamento!X985","v":{"$error":"#DIV/0!"}}]
["","6.",{"$f":"Orçamento!$P986","v":""},null,"","",{"$f":"IFERROR(Orçamento!S986,\"-\")","v":0},{"$f":"IFERROR(Orçamento!V986,\"\")","v":0},{"$f":"Orçamento!X986","v":{"$error":"#DIV/0!"}}]
["","7.",{"$f":"Orçamento!$P987","v":""},null,"","",{"$f":"IFERROR(Orçamento!S987,\"-\")","v":0},{"$f":"IFERROR(Orçamento!V987,\"\")","v":0},{"$f":"Orçamento!X987","v":{"$error":"#DIV/0!"}}]
["","8.",{"$f":"Orçamento!$P988","v":""},null,"","",{"$f":"IFERROR(Orçamento!S988,\"-\")","v":0},{"$f":"IFERROR(Orçamento!V988,\"\")","v":0},{"$f":"Orçamento!X988","v":{"$error":"#DIV/0!"}}]
["","9.",{"$f":"Orçamento!$P989","v":""},null,"","",{"$f":"IFERROR(Orçamento!S989,\"-\")","v":0},{"$f":"IFERROR(Orçamento!V989,\"\")","v":0},{"$f":"Orçamento!X989","v":{"$error":"#DIV/0!"}}]
["","10.",{"$f":"Orçamento!$P990","v":""},null,"","",{"$f":"IFERROR(Orçamento!S990,\"-\")","v":0},{"$f":"IFERROR(Orçamento!V990,\"\")","v":0},{"$f":"Orçamento!X990","v":{"$error":"#DIV/0!"}}]
["","11.",{"$f":"Orçamento!$P991","v":""},null,"","",{"$f":"IFERROR(Orçamento!S991,\"-\")","v":0},{"$f":"IFERROR(Orçamento!V991,\"\")","v":0},{"$f":"Orçamento!X991","v":{"$error":"#DIV/0!"}}]
["","12.",{"$f":"Orçamento!$P992","v":""},null,"","",{"$f":"IFERROR(Orçamento!S992,\"-\")","v":0},{"$f":"IFERROR(Orçamento!V992,\"\")","v":0},{"$f":"Orçamento!X992","v":{"$error":"#DIV/0!"}}]
["","13.",{"$f":"Orçamento!$P993","v":""},null,"","",{"$f":"IFERROR(Orçamento!S993,\"-\")","v":0},{"$f":"IFERROR(Orçamento!V993,\"\")","v":0},{"$f":"Orçamento!X993","v":{"$error":"#DIV/0!"}}]
["","14.",{"$f":"Orçamento!$P994","v":""},null,"","",{"$f":"IFERROR(Orçamento!S994,\"-\")","v":0},{"$f":"IFERROR(Orçamento!V994,\"\")","v":0},{"$f":"Orçamento!X994","v":{"$error":"#DIV/0!"}}]
["","15.",{"$f":"Orçamento!$P995","v":""},null,"","",{"$f":"IFERROR(Orçamento!S995,\"-\")","v":0},{"$f":"IFERROR(Orçamento!V995,\"\")","v":0},{"$f":"Orçamento!X995","v":{"$error":"#DIV/0!"}}]
["","16.",{"$f":"Orçamento!$P996","v":""},null,"","",{"$f":"IFERROR(Orçamento!S996,\"-\")","v":0},{"$f":"IFERROR(Orçamento!V996,\"\")","v":0},{"$f":"Orçamento!X996","v":{"$error":"#DIV/0!"}}]
["","17.",{"$f":"Orçamento!$P997","v":""},null,"","",{"$f":"IFERROR(Orçamento!S997,\"-\")","v":0},{"$f":"IFERROR(Orçamento!V997,\"\")","v":0},{"$f":"Orçamento!X997","v":{"$error":"#DIV/0!"}}]
["","18.",{"$f":"Orçamento!$P998","v":""},null,"","",{"$f":"IFERROR(Orçamento!S998,\"-\")","v":0},{"$f":"IFERROR(Orçamento!V998,\"\")","v":0},{"$f":"Orçamento!X998","v":{"$error":"#DIV/0!"}}]
["","19.",{"$f":"Orçamento!$P999","v":""},null,"","",{"$f":"IFERROR(Orçamento!S999,\"-\")","v":0},{"$f":"IFERROR(Orçamento!V999,\"\")","v":0},{"$f":"Orçamento!X999","v":{"$error":"#DIV/0!"}}]
["","20.",{"$f":"Orçamento!$P1000","v":""},null,"","",{"$f":"IFERROR(Orçamento!S1000,\"-\")","v":0},{"$f":"IFERROR(Orçamento!V1000,\"\")","v":0},{"$f":"Orçamento!X1000","v":{"$error":"#DIV/0!"}}]
["F","TOTAL GERAL DO ORÇAMENTO (R$)",null,null,null,null,{"$f":"SUM(G17:G36)","v":0},{"$f":"SUM(H17:H36)","v":0},{"$f":"SUM(I17:I36)","v":{"$error":"#DIV/0!"}}]
["F"]
["F"]

{"sheet":"Somatório","index":2,"n_rows":45,"n_cols":6,"rows_kept":45,"cut":false,"hidden":false,"merged":[[13,0,14,0],[42,1,42,2],[44,1,44,5],[47,3,47,5],[48,3,48,5],[13,1,13,5],[9,1,9,3],[9,4,9,5],[11,1,11,2],[11,4,11,5],[12,1,12,2],[12,4,12,5],[0,1,0,5],[14,1,14,5],[2,1,2,3],[2,4,2,5],[3,1,3,3],[3,4,3,5],[5,1,5,3],[5,4,5,5],[6,1,6,3],[6,4,6,5],[8,1,8,3],[8,4,8,5],[1,1,1,5],[4,1,4,5],[7,1,7,5],[10,1,10,5]]}
[]
[]
[null,"UNIDADE ESCOLAR",null,null,"CÓDIGO INEP"]
[null,{"$f":"Orçamento!$O$4","v":"CENTRO DE ENSINO EM PERÍODO INTEGRAL SYLVIO DE MELLO"},null,null,{"$f":"Orçamento!V4","v":52069206}]
[]
[null,"OBRA",null,null,"CIDADE"]
[null,{"$f":"Orçamento!$O$7","v":"REFORMA"},null,null,{"$f":"Orçamento!$V$7","v":"MORRINHOS"}]
[]
[null,"ENDEREÇO",null,null,"CRE"]
[null,{"$f":"Orçamento!$R$10","v":"RUA PIAUI 386, CENTRO, CEP:75650-000"},null,null,{"$f":"Orçamento!$O$10","v":"MORRINHOS"}]
[]
[null,"REFERÊNCIA",null,"DATA","ÁREA TOTAL CONSTRUÍDA (M²)"]
[null,{"$f":"CONCATENATE(\"AGETOP E SINAPI - \",Orçamento!$T$10)","v":"AGETOP E SINAPI - DESONERADA"},null,{"$f":"Orçamento!$S$7","v":"2020-07-07"},{"$f":"Orçamento!$V$13","v":3042.44}]
["FILTRO"]
[null,"SOMATÓRIO DE SERVIÇOS"]
["↓","ITEM","DESCRIÇÃO DOS SERVIÇOS","PREÇO SEM BDI (R$)","PREÇO COM BDI (R$)","PARTIC.  ( % )"]
[{"$f":"IF(D17>0,\"F\",\"\")","v":""},"a.",{"$f":"Orçamento!P947","v":"SERVIÇOS PRELIMINARES"},{"$f":"Orçamento!S947","v":0},{"$f":"Orçamento!V947","v":0},{"$f":"Orçamento!X947","v":0}]
[{"$f":"IF(D18>0,\"F\",\"\")","v":""},"b.",{"$f":"Orçamento!P948","v":"TRANSPORTES"},{"$f":"Orçamento!S948","v":0},{"$f":"Orçamento!V948","v":0},{"$f":"Orçamento!X948","v":0}]
["","c.",{"$f":"Orçamento!P949","v":"SERVIÇO EM TERRA"},{"$f":"Orçamento!S949","v":0},{"$f":"Orçamento!V949","v":0},{"$f":"Orçamento!X949","v":0}]
["","d.",{"$f":"Orçamento!P950","v":"FUNDAÇÕES E SONDAGENS"},{"$f":"Orçamento!S950","v":0},{"$f":"Orçamento!V950","v":0},{"$f":"Orçamento!X950","v":0}]
["","e.",{"$f":"Orçamento!P951","v":"ESTRUTURA"},{"$f":"Orçamento!S951","v":0},{"$f":"Orçamento!V951","v":0},{"$f":"Orçamento!X951","v":0}]
["","f.",{"$f":"Orçamento!P952","v":"INSTALAÇÕES ELÉTRICAS"},{"$f":"Orçamento!S952","v":0},{"$f":"Orçamento!V952","v":0},{"$f":"Orçamento!X952","v":0}]
["","g.",{"$f":"Orçamento!P953","v":"INSTALAÇÕES HIDROSSANITÁRIAS"},{"$f":"Orçamento!S953","v":0},{"$f":"Orçamento!V953","v":0},{"$f":"Orçamento!X953","v":0}]
["","h.",{"$f":"Orçamento!P954","v":"INSTALAÇÕES ESPECIAIS"},{"$f":"Orçamento!S954","v":0},{"$f":"Orçamento!V954","v":0},{"$f":"Orçamento!X954","v":0}]
["","i.",{"$f":"Orçamento!P955","v":"ALVENARIAS E DIVISÓRIAS"},{"$f":"Orçamento!S955","v":0},{"$f":"Orçamento!V955","v":0},{"$f":"Orçamento!X955","v":0}]
["","j.",{"$f":"Orçamento!P956","v":"ALVENARIA AUTO-PORTANTE"},{"$f":"Orçamento!S956","v":0},{"$f":"Orçamento!V956","v":0},{"$f":"Orçamento!X956","v":0}]
["","k.",{"$f":"Orçamento!P957","v":"IMPERMEABILIZAÇÃO"},{"$f":"Orçamento!S957","v":0},{"$f":"Orçamento!V957","v":0},{"$f":"Orçamento!X957","v":0}]
["","l.",{"$f":"Orçamento!P958","v":"ISOLAMENTO TÉRMICO E ACÚSTICO"},{"$f":"Orçamento!S958","v":0},{"$f":"Orçamento!V958","v":0},{"$f":"Orçamento!X958","v":0}]
["","m.",{"$f":"Orçamento!P959","v":"ESTRUTURA DE MADEIRA"},{"$f":"Orçamento!S959","v":0},{"$f":"Orçamento!V959","v":0},{"$f":"Orçamento!X959","v":0}]
["","n.",{"$f":"Orçamento!P960","v":"ESTRUTURAS METÁLICAS"},{"$f":"Orçamento!S960","v":0},{"$f":"Orçamento!V960","v":0},{"$f":"Orçamento!X960","v":0}]
["","o.",{"$f":"Orçamento!P961","v":"COBERTURAS"},{"$f":"Orçamento!S961","v":0},{"$f":"Orçamento!V961","v":0},{"$f":"Orçamento!X961","v":0}]
["","p.",{"$f":"Orçamento!P962","v":"ESQUADRIAS DE MADEIRA"},{"$f":"Orçamento!S962","v":0},{"$f":"Orçamento!V962","v":0},{"$f":"Orçamento!X962","v":0}]
["","q.",{"$f":"Orçamento!P963","v":"ESQUADRIAS METÁLICAS"},{"$f":"Orçamento!S963","v":0},{"$f":"Orçamento!V963","v":0},{"$f":"Orçamento!X963","v":0}]
["","r.",{"$f":"Orçamento!P964","v":"VIDROS"},{"$f":"Orçamento!S964","v":0},{"$f":"Orçamento!V964","v":0},{"$f":"Orçamento!X964","v":0}]
["","s.",{"$f":"Orçamento!P965","v":"REVESTIMENTO DE PAREDE"},{"$f":"Orçamento!S965","v":0},{"$f":"Orçamento!V965","v":0},{"$f":"Orçamento!X965","v":0}]
["","t.",{"$f":"Orçamento!P966","v":"FORROS"},{"$f":"Orçamento!S966","v":0},{"$f":"Orçamento!V966","v":0},{"$f":"Orçamento!X966","v":0}]
["","u.",{"$f":"Orçamento!P967","v":"REVESTIMENTO DE PISO"},{"$f":"Orçamento!S967","v":0},{"$f":"Orçamento!V967","v":0},{"$f":"Orçamento!X967","v":0}]
["","v.",{"$f":"Orçamento!P968","v":"FERRAGENS"},{"$f":"Orçamento!S968","v":0},{"$f":"Orçamento!V968","v":0},{"$f":"Orçamento!X968","v":0}]
["","w.",{"$f":"Orçamento!P969","v":"MARCENARIA"},{"$f":"Orçamento!S969","v":0},{"$f":"Orçamento!V969","v":0},{"$f":"Orçamento!X969","v":0}]
["","x.",{"$f":"Orçamento!P970","v":"ADMINISTRAÇÃO"},{"$f":"Orçamento!S970","v":0},{"$f":"Orçamento!V970","v":0},{"$f":"Orçamento!X970","v":0}]
["","y.",{"$f":"Orçamento!P971","v":"PINTURA"},{"$f":"Orçamento!S971","v":0},{"$f":"Orçamento!V971","v":0},{"$f":"Orçamento!X971","v":0}]
["","z.",{"$f":"Orçamento!P972","v":"DIVERSOS"},{"$f":"Orçamento!S972","v":0},{"$f":"Orçamento!V972","v":0},{"$f":"Orçamento!X972","v":0}]
["F","TOTAL GERAL DO ORÇAMENTO",null,{"$f":"SUM(D17:D42)","v":0},{"$f":"SUM(E17:E42)","v":0},{"$f":"SUM(F17:F42)","v":0}]
[]
[null,"(*) Para itens da AGETOP, os vidros não estão inclusos nas esquadrias e já foram considerados os custos de contramarco para as esquadrias de alumínio;"]

{"sheet":"Cronog_120_Dias","index":3,"n_rows":99,"n_cols":24,"rows_kept":99,"cut":false,"hidden":false,"merged":[[0,1,0,21],[1,1,1,21],[2,1,2,7],[2,8,2,21],[3,1,3,7],[3,8,3,21],[8,1,8,7],[8,8,8,21],[9,0,11,0],[9,1,9,7],[9,8,9,21],[10,1,10,21],[11,1,11,21],[4,1,4,21],[5,1,5,7],[5,8,5,21],[6,1,6,7],[6,8,6,21],[7,1,7,21],[12,21,13,21],[13,1,13,2],[13,5,13,8],[13,9,13,12],[13,13,13,16],[13,17,13,20],[12,0,13,0],[12,3,13,3],[12,5,12,8],[12,9,12,12],[12,13,12,16],[12,17,12,20],[17,1,19,2],[17,3,19,3],[17,4,19,4],[17,5,17,8],[17,9,17,12],[14,1,16,2],[14,3,16,3],[14,4,16,4],[14,5,14,8],[14,9,14,12],[17,13,17,16],[17,17,17,20],[19,5,19,8],[19,9,19,12],[19,13,19,16],[19,17,19,20],[14,17,14,20],[16,5,16,8],[16,9,16,12],[16,13,16,16],[16,17,16,20],[14,13,14,16],[23,1,25,2],[23,3,25,3],[23,4,25,4],[23,5,23,8],[23,9,23,12],[20,1,22,2],[20,3,22,3],[20,4,22,4],[20,5,20,8],[20,9,20,12],[23,13,23,16],[23,17,23,20],[25,5,25,8],[25,9,25,12],[25,13,25,16],[25,17,25,20],[20,17,20,20],[22,5,22,8],[22,9,22,12],[22,13,22,16],[22,17,22,20],[20,13,20,16],[29,1,31,2],[29,3,31,3],[29,4,31,4],[29,5,29,8],[29,9,29,12],[26,1,28,2],[26,3,28,3],[26,4,28,4],[26,5,26,8],[26,9,26,12],[29,13,29,16],[29,17,29,20],[31,5,31,8],[31,9,31,12],[31,13,31,16],[31,17,31,20],[26,17,26,20],[28,5,28,8],[28,9,28,12],[28,13,28,16],[28,17,28,20],[26,13,26,16],[35,1,37,2],[35,3,37,3],[35,4,37,4],[35,5,35,8],[35,9,35,12],[32,1,34,2],[32,3,34,3],[32,4,34,4],[32,5,32,8],[32,9,32,12],[35,13,35,16],[35,17,35,20],[37,5,37,8],[37,9,37,12],[37,13,37,16],[37,17,37,20],[32,17,32,20],[34,5,34,8],[34,9,34,12],[34,13,34,16],[34,17,34,20],[32,13,32,16],[41,1,43,2],[41,3,43,3],[41,4,43,4],[41,5,41,8],[41,9,41,12],[38,1,40,2],[38,3,40,3],[38,4,40,4],[38,5,38,8],[38,9,38,12],[41,13,41,16],[41,17,41,20],[43,5,43,8],[43,9,43,12],[43,13,43,16],[43,17,43,20],[38,17,38,20],[40,5,40,8],[40,9,40,12],[40,13,40,16],[40,17,40,20],[38,13,38,16],[47,1,49,2],[47,3,49,3],[47,4,49,4],[47,5,47,8],[47,9,47,12],[44,1,46,2],[44,3,46,3],[44,4,46,4],[44,5,44,8],[44,9,44,12],[47,13,47,16],[47,17,47,20],[49,5,49,8],[49,9,49,12],[49,13,49,16],[49,17,49,20],[44,17,44,20],[46,5,46,8],[46,9,46,12],[46,13,46,16],[46,17,46,20],[44,13,44,16],[53,1,55,2],[53,3,55,3],[53,4,55,4],[53,5,53,8],[53,9,53,12],[50,1,52,2],[50,3,52,3],[50,4,52,4],[50,5,50,8],[50,9,50,12],[53,13,53,16],[53,17,53,20],[55,5,55,8],[55,9,55,12],[55,13,55,16],[55,17,55,20],[50,17,50,20],[52,5,52,8],[52,9,52,12],[52,13,52,16],[52,17,52,20],[50,13,50,16],[59,1,61,2],[59,3,61,3],[59,4,61,4],[59,5,59,8],[59,9,59,12],[56,1,58,2],[56,3,58,3],[56,4,58,4],[56,5,56,8],[56,9,56,12],[59,13,59,16],[59,17,59,20],[61,5,61,8],[61,9,61,12],[61,13,61,16],[61,17,61,20],[56,17,56,20],[58,5,58,8],[58,9,58,12],[58,13,58,16],[58,17,58,20],[56,13,56,16],[65,1,67,2],[65,3,67,3],[65,4,67,4],[65,5,65,8],[65,9,65,12],[62,1,64,2],[62,3,64,3],[62,4,64,4],[62,5,62,8],[62,9,62,12],[65,13,65,16],[65,17,65,20],[67,5,67,8],[67,9,67,12],[67,13,67,16],[67,17,67,20],[62,17,62,20],[64,5,64,8],[64,9,64,12],[64,13,64,16],[64,17,64,20],[62,13,62,16],[71,1,73,2],[71,3,73,3],[71,4,73,4],[71,5,71,8],[71,9,71,12],[68,1,70,2],[68,3,70,3],[68,4,70,4],[68,5,68,8],[68,9,68,12],[71,13,71,16],[71,17,71,20],[73,5,73,8],[73,9,73,12],[73,13,73,16],[73,17,73,20],[68,17,68,20],[70,5,70,8],[70,9,70,12],[70,13,70,16],[70,17,70,20],[68,13,68,16],[77,1,79,2],[77,3,79,3],[77,4,79,4],[77,5,77,8],[77,9,77,12],[74,1,76,2],[74,3,76,3],[74,4,76,4],[74,5,74,8],[74,9,74,12],[77,13,77,16],[77,17,77,20],[79,5,79,8],[79,9,79,12],[79,13,79,16],[79,17,79,20],[74,17,74,20],[76,5,76,8],[76,9,76,12],[76,13,76,16],[76,17,76,20],[74,13,74,16],[83,1,85,2],[83,3,85,3],[83,4,85,4],[83,5,83,8],[83,9,83,12],[80,1,82,2],[80,3,82,3],[80,4,82,4],[80,5,80,8],[80,9,80,12],[83,13,83,16],[83,17,83,20],[85,5,85,8],[85,9,85,12],[85,13,85,16],[85,17,85,20],[80,17,80,20],[82,5,82,8],[82,9,82,12],[82,13,82,16],[82,17,82,20],[80,13,80,16],[89,1,91,2],[89,3,91,3],[89,4,91,4],[89,5,89,8],[89,9,89,12],[86,1,88,2],[86,3,88,3],[86,4,88,4],[86,5,86,8],[86,9,86,12],[89,13,89,16],[89,17,89,20],[91,5,91,8],[91,9,91,12],[91,13,91,16],[91,17,91,20],[86,17,86,20],[88,5,88,8],[88,9,88,12],[88,13,88,16],[88,17,88,20],[86,13,86,16],[92,1,92,2],[92,5,92,8],[92,9,92,12],[92,13,92,16],[92,17,92,20],[93,1,93,2],[93,5,93,8],[93,9,93,12],[93,13,93,16],[93,17,93,20],[97,1,97,4],[98,1,98,21],[94,1,94,2],[94,5,94,8],[94,9,94,12],[94,13,94,16],[94,17,94,20],[95,1,95,2],[95,5,95,8],[95,9,95,12],[95,13,95,16],[95,17,95,20]]}
[]
[]
[null,"UNIDADE ESCOLAR",null,null,null,null,null,null,"PRAZO"]
[null,{"$f":"Orçamento!O4","v":"CENTRO DE ENSINO EM PERÍODO INTEGRAL SYLVIO DE MELLO"},null,null,null,null,null,null,"120 DIAS CORRIDOS"]
[]
[null,"OBRA",null,null,null,null,null,null,"DATA"]
[null,{"$f":"Orçamento!O7","v":"REFORMA"},null,null,null,null,null,null,{"$f":"Orçamento!S7","v":"2020-07-07"}]
[]
[null,"LOCAL",null,null,null,null,null,null,"ÁREA TOTAL CONSTRUÍDA (M²)"]
["FILTRO",{"$f":"Orçamento!V7","v":"MORRINHOS"},null,null,null,null,null,null,{"$f":"Orçamento!V13","v":3042.44}]
[]
[null,"CRONOGRAMA - FÍSICO FINANCEIRO"]
["↓","CUSTO TOTAL:",{"$f":"D93","v":0},"VALOR","Dias:",30,null,null,null,60,null,null,null,90,null,null,null,120,null,null,null,"TOTAL"]
[null,"DESCRIÇÃO DOS SERVIÇOS",null,null,"%","1ª PARCELA",null,null,null,"2ª PARCELA",null,null,null,"3ª PARCELA",null,null,null,"4ª PARCELA"]
[{"$f":"IF(D15>0,\"F\",\"\")","v":""},"SERVIÇOS PRELIMINARES",null,{"$f":"Orçamento!V947","v":0},{"$f":"Orçamento!X947","v":0},{"$f":"ROUND(F17*$D$15,2)","v":0},null,null,null,{"$f":"ROUND(J17*$D$15,2)","v":0},null,null,null,{"$f":"ROUND(N17*$D$15,2)","v":0},null,null,null,{"$f":"ROUND(R17*$D$15,2)","v":0},null,null,null,{"$f":"SUM(F15:U15)","v":0},null,{"$f":"IF(D15=V15,\"OK\",\"ERRO\")","v":"OK"}]
[{"$f":"IF(A15=\"F\",A15,\"\")","v":""}]
[{"$f":"IF(A16=\"F\",A16,\"\")","v":""},null,null,null,null,1,null,null,null,0,null,null,null,0,null,null,null,{"$f":"100%-(SUM(F17:Q17))","v":0},null,null,null,{"$f":"IFERROR(E15/100,\"\")","v":0},null,{"$f":"IF(E15=V17*100,\"OK\",\"ERRO\")","v":"OK"}]
[{"$f":"IF(D18>0,\"F\",\"\")","v":""},"TRANSPORTES",null,{"$f":"Orçamento!V948","v":0},{"$f":"Orçamento!X948","v":0},{"$f":"ROUND(F20*$D$18,2)","v":0},null,null,null,{"$f":"ROUND(J20*$D$18,2)","v":0},null,null,null,{"$f":"ROUND(N20*$D$18,2)","v":0},null,null,null,{"$f":"ROUND(R20*$D$18,2)","v":0},null,null,null,{"$f":"SUM(F18:U18)","v":0},null,{"$f":"IF(D18=V18,\"OK\",\"ERRO\")","v":"OK"}]
[{"$f":"IF(A18=\"F\",A18,\"\")","v":""}]
[{"$f":"IF(A19=\"F\",A19,\"\")","v":""},null,null,null,null,0.25019999999999998,null,null,null,{"$f":"F20","v":0.25019999999999998},null,null,null,{"$f":"J20","v":0.25019999999999998},null,null,null,{"$f":"100%-(SUM(F20:Q20))","v":0.24940000000000007},null,null,null,{"$f":"IFERROR(E18/100,\"\")","v":0},null,{"$f":"IF(E18=V20*100,\"OK\",\"ERRO\")","v":"OK"}]
[{"$f":"IF(D21>0,\"F\",\"\")","v":""},"SERVIÇO EM TERRA",null,{"$f":"Orçamento!V949","v":0},{"$f":"Orçamento!X949","v":0},{"$f":"ROUND(F23*$D$21,2)","v":0},null,null,null,{"$f":"ROUND(J23*$D$21,2)","v":0},null,null,null,{"$f":"ROUND(N23*$D$21,2)","v":0},null,null,null,{"$f":"ROUND(R23*$D$21,2)","v":0},null,null,null,{"$f":"SUM(F21:U21)","v":0},null,{"$f":"IF(D21=V21,\"OK\",\"ERRO\")","v":"OK"}]
[{"$f":"IF(A21=\"F\",A21,\"\")","v":""}]
[{"$f":"IF(A22=\"F\",A22,\"\")","v":""},null,null,null,null,1,null,null,null,0,null,null,null,0,null,null,null,{"$f":"100%-(SUM(F23:Q23))","v":0},null,null,null,{"$f":"IFERROR(E21/100,\"\")","v":0},null,{"$f":"IF(E21=V23*100,\"OK\",\"ERRO\")","v":"OK"}]
[{"$f":"IF(D24>0,\"F\",\"\")","v":""},"FUNDAÇÕES E SONDAGENS",null,{"$f":"Orçamento!V950","v":0},{"$f":"Orçamento!X950","v":0},{"$f":"ROUND(F26*$D$24,2)","v":0},null,null,null,{"$f":"ROUND(J26*$D$24,2)","v":0},null,null,null,{"$f":"ROUND(N26*$D$24,2)","v":0},null,null,null,{"$f":"ROUND(R26*$D$24,2)","v":0},null,null,null,{"$f":"SUM(F24:U24)","v":0},null,{"$f":"IF(D24=V24,\"OK\",\"ERRO\")","v":"OK"}]
[{"$f":"IF(A24=\"F\",A24,\"\")","v":""}]
[{"$f":"IF(A25=\"F\",A25,\"\")","v":""},null,null,null,null,1,null,null,null,0,null,null,null,null,null,null,null,{"$f":"100%-(SUM(F26:Q26))","v":0},null,null,null,{"$f":"IFERROR(E24/100,\"\")","v":0},null,{"$f":"IF(E24=V26*100,\"OK\",\"ERRO\")","v":"OK"}]
[{"$f":"IF(D27>0,\"F\",\"\")","v":""},"ESTRUTURA",null,{"$f":"Orçamento!V951","v":0},{"$f":"Orçamento!X951","v":0},{"$f":"ROUND(F29*$D$27,2)","v":0},null,null,null,{"$f":"ROUND(J29*$D$27,2)","v":0},null,null,null,{"$f":"ROUND(N29*$D$27,2)","v":0},null,null,null,{"$f":"ROUND(R29*$D$27,2)","v":0},null,null,null,{"$f":"SUM(F27:U27)","v":0},null,{"$f":"IF(D27=V27,\"OK\",\"ERRO\")","v":"OK"}]
[{"$f":"IF(A27=\"F\",A27,\"\")","v":""}]
[{"$f":"IF(A28=\"F\",A28,\"\")","v":""},null,null,null,null,0.4,null,null,null,0.6,null,null,null,0,null,null,null,{"$f":"100%-(SUM(F29:Q29))","v":0},null,null,null,{"$f":"IFERROR(E27/100,\"\")","v":0},null,{"$f":"IF(E27=V29*100,\"OK\",\"ERRO\")","v":"OK"}]
[{"$f":"IF(D30>0,\"F\",\"\")","v":""},"INST.ELET/TELEFÔNICA/CABEAMENTO ESTRUTURADO",null,{"$f":"Orçamento!V952","v":0},{"$f":"Orçamento!X952","v":0},{"$f":"ROUND(F32*$D$30,2)","v":0},null,null,null,{"$f":"ROUND(J32*$D$30,2)","v":0},null,null,null,{"$f":"ROUND(N32*$D$30,2)","v":0},null,null,null,{"$f":"ROUND(R32*$D$30,2)","v":0},null,null,null,{"$f":"SUM(F30:U30)","v":0},null,{"$f":"IF(D30=V30,\"OK\",\"ERRO\")","v":"OK"}]
[{"$f":"IF(A30=\"F\",A30,\"\")","v":""}]
[{"$f":"IF(A31=\"F\",A31,\"\")","v":""},null,null,null,null,null,null,null,null,0.75,null,null,null,0.25,null,null,null,{"$f":"100%-(SUM(F32:Q32))","v":0},null,null,null,{"$f":"IFERROR(E30/100,\"\")","v":0},null,{"$f":"IF(E30=V32*100,\"OK\",\"ERRO\")","v":"OK"}]
[{"$f":"IF(D33>0,\"F\",\"\")","v":""},"INSTALAÇÕES HIDROSSANITÁRIAS",null,{"$f":"Orçamento!V953","v":0},{"$f":"Orçamento!X953","v":0},{"$f":"ROUND(F35*$D$33,2)","v":0},null,null,null,{"$f":"ROUND(J35*$D$33,2)","v":0},null,null,null,{"$f":"ROUND(N35*$D$33,2)","v":0},null,null,null,{"$f":"ROUND(R35*$D$33,2)","v":0},null,null,null,{"$f":"SUM(F33:U33)","v":0},null,{"$f":"IF(D33=V33,\"OK\",\"ERRO\")","v":"OK"}]
[{"$f":"IF(A33=\"F\",A33,\"\")","v":""}]
[{"$f":"IF(A34=\"F\",A34,\"\")","v":""},null,null,null,null,null,null,null,null,0.75,null,null,null,0.25,null,null,null,{"$f":"100%-(SUM(F35:Q35))","v":0},null,null,null,{"$f":"IFERROR(E33/100,\"\")","v":0},null,{"$f":"IF(E33=V35*100,\"OK\",\"ERRO\")","v":"OK"}]
[{"$f":"IF(D36>0,\"F\",\"\")","v":""},"INSTALAÇÕES ESPECIAIS",null,{"$f":"Orçamento!V954","v":0},{"$f":"Orçamento!X954","v":0},{"$f":"ROUND(F38*$D$36,2)","v":0},null,null,null,{"$f":"ROUND(J38*$D$36,2)","v":0},null,null,null,{"$f":"ROUND(N38*$D$36,2)","v":0},null,null,null,{"$f":"ROUND(R38*$D$36,2)","v":0},null,null,null,{"$f":"SUM(F36:U36)","v":0},null,{"$f":"IF(D36=V36,\"OK\",\"ERRO\")","v":"OK"}]
[{"$f":"IF(A36=\"F\",A36,\"\")","v":""}]
[{"$f":"IF(A37=\"F\",A37,\"\")","v":""},null,null,null,null,null,null,null,null,0.63,null,null,null,0.37,null,null,null,{"$f":"100%-(SUM(F38:Q38))","v":0},null,null,null,{"$f":"IFERROR(E36/100,\"\")","v":0},null,{"$f":"IF(E36=V38*100,\"OK\",\"ERRO\")","v":"OK"}]
[{"$f":"IF(D39>0,\"F\",\"\")","v":""},"ALVENARIA E DIVISÓRIAS",null,{"$f":"Orçamento!V955","v":0},{"$f":"Orçamento!X955","v":0},{"$f":"ROUND(F41*$D$39,2)","v":0},null,null,null,{"$f":"ROUND(J41*$D$39,2)","v":0},null,null,null,{"$f":"ROUND(N41*$D$39,2)","v":0},null,null,null,{"$f":"ROUND(R41*$D$39,2)","v":0},null,null,null,{"$f":"SUM(F39:U39)","v":0},null,{"$f":"IF(D39=V39,\"OK\",\"ERRO\")","v":"OK"}]
[{"$f":"IF(A39=\"F\",A39,\"\")","v":""}]
[{"$f":"IF(A40=\"F\",A40,\"\")","v":""},null,null,null,null,null,null,null,null,0.63,null,null,null,0.37,null,null,null,{"$f":"100%-(SUM(F41:Q41))","v":0},null,null,null,{"$f":"IFERROR(E39/100,\"\")","v":0},null,{"$f":"IF(E39=V41*100,\"OK\",\"ERRO\")","v":"OK"}]
[{"$f":"IF(D42>0,\"F\",\"\")","v":""},"ALVENARIA AUTO-PORTANTE",null,{"$f":"Orçamento!V956","v":0},{"$f":"Orçamento!X956","v":0},{"$f":"ROUND(F44*$D$42,2)","v":0},null,null,null,{"$f":"ROUND(J44*$D$42,2)","v":0},null,null,null,{"$f":"ROUND(N44*$D$42,2)","v":0},null,null,null,{"$f":"ROUND(R44*$D$42,2)","v":0},null,null,null,{"$f":"SUM(F42:U42)","v":0},null,{"$f":"IF(D42=V42,\"OK\",\"ERRO\")","v":"OK"}]
[{"$f":"IF(A42=\"F\",A42,\"\")","v":""}]
[{"$f":"IF(A43=\"F\",A43,\"\")","v":""},null,null,null,null,null,null,null,null,0.63,null,null,null,0.37,null,null,null,{"$f":"100%-(SUM(F44:Q44))","v":0},null,null,null,{"$f":"IFERROR(E42/100,\"\")","v":0},null,{"$f":"IF(E42=V44*100,\"OK\",\"ERRO\")","v":"OK"}]
[{"$f":"IF(D45>0,\"F\",\"\")","v":""},"IMPERMEABILIZAÇÃO",null,{"$f":"Orçamento!V957","v":0},{"$f":"Orçamento!X957","v":0},{"$f":"ROUND(F47*$D$45,2)","v":0},null,null,null,{"$f":"ROUND(J47*$D$45,2)","v":0},null,null,null,{"$f":"ROUND(N47*$D$45,2)","v":0},null,null,null,{"$f":"ROUND(R47*$D$45,2)","v":0},null,null,null,{"$f":"SUM(F45:U45)","v":0},null,{"$f":"IF(D45=V45,\"OK\",\"ERRO\")","v":"OK"}]
[{"$f":"IF(A45=\"F\",A45,\"\")","v":""}]
[{"$f":"IF(A46=\"F\",A46,\"\")","v":""},null,null,null,null,0.35,null,null,null,0.35,null,null,null,0.3,null,null,null,{"$f":"100%-(SUM(F47:Q47))","v":0},null,null,null,{"$f":"IFERROR(E45/100,\"\")","v":0},null,{"$f":"IF(E45=V47*100,\"OK\",\"ERRO\")","v":"OK"}]
[{"$f":"IF(D48>0,\"F\",\"\")","v":""},"ISOLAMENTO TÉRMICO E ACÚSTICO",null,{"$f":"Orçamento!V958","v":0},{"$f":"Orçamento!X958","v":0},{"$f":"ROUND(F50*$D$48,2)","v":0},null,null,null,{"$f":"ROUND(J50*$D$48,2)","v":0},null,null,null,{"$f":"ROUND(N50*$D$48,2)","v":0},null,null,null,{"$f":"ROUND(R50*$D$48,2)","v":0},null,null,null,{"$f":"SUM(F48:U48)","v":0},null,{"$f":"IF(D48=V48,\"OK\",\"ERRO\")","v":"OK"}]
[{"$f":"IF(A48=\"F\",A48,\"\")","v":""}]
[{"$f":"IF(A49=\"F\",A49,\"\")","v":""},null,null,null,null,null,null,null,null,0.55000000000000004,null,null,null,0.4,null,null,null,{"$f":"100%-(SUM(F50:Q50))","v":4.9999999999999933E-2},null,null,null,{"$f":"IFERROR(E48/100,\"\")","v":0},null,{"$f":"IF(E48=V50*100,\"OK\",\"ERRO\")","v":"OK"}]
[{"$f":"IF(D51>0,\"F\",\"\")","v":""},"ESTRUTURA DE MADEIRA",null,{"$f":"Orçamento!V959","v":0},{"$f":"Orçamento!X959","v":0},{"$f":"ROUND(F53*$D$51,2)","v":0},null,null,null,{"$f":"ROUND(J53*$D$51,2)","v":0},null,null,null,{"$f":"ROUND(N53*$D$51,2)","v":0},null,null,null,{"$f":"ROUND(R53*$D$51,2)","v":0},null,null,null,{"$f":"SUM(F51:U51)","v":0},null,{"$f":"IF(D51=V51,\"OK\",\"ERRO\")","v":"OK"}]
[{"$f":"IF(A51=\"F\",A51,\"\")","v":""}]
[{"$f":"IF(A52=\"F\",A52,\"\")","v":""},null,null,null,null,null,null,null,null,0.35,null,null,null,0.65,null,null,null,{"$f":"100%-(SUM(F53:Q53))","v":0},null,null,null,{"$f":"IFERROR(E51/100,\"\")","v":0},null,{"$f":"IF(E51=V53*100,\"OK\",\"ERRO\")","v":"OK"}]
[{"$f":"IF(D54>0,\"F\",\"\")","v":""},"ESTRUTURA METÁLICA",null,{"$f":"Orçamento!V960","v":0},{"$f":"Orçamento!X960","v":0},{"$f":"ROUND(F56*$D$54,2)","v":0},null,null,null,{"$f":"ROUND(J56*$D$54,2)","v":0},null,null,null,{"$f":"ROUND(N56*$D$54,2)","v":0},null,null,null,{"$f":"ROUND(R56*$D$54,2)","v":0},null,null,null,{"$f":"SUM(F54:U54)","v":0},null,{"$f":"IF(D54=V54,\"OK\",\"ERRO\")","v":"OK"}]
[{"$f":"IF(A54=\"F\",A54,\"\")","v":""}]
[{"$f":"IF(A55=\"F\",A55,\"\")","v":""},null,null,null,null,null,null,null,null,0.35,null,null,null,0.65,null,null,null,{"$f":"100%-(SUM(F56:Q56))","v":0},null,null,null,{"$f":"IFERROR(E54/100,\"\")","v":0},null,{"$f":"IF(E54=V56*100,\"OK\",\"ERRO\")","v":"OK"}]
[{"$f":"IF(D57>0,\"F\",\"\")","v":""},"COBERTURAS",null,{"$f":"Orçamento!V961","v":0},{"$f":"Orçamento!X961","v":0},{"$f":"ROUND(F59*$D$57,2)","v":0},null,null,null,{"$f":"ROUND(J59*$D$57,2)","v":0},null,null,null,{"$f":"ROUND(N59*$D$57,2)","v":0},null,null,null,{"$f":"ROUND(R59*$D$57,2)","v":0},null,null,null,{"$f":"SUM(F57:U57)","v":0},null,{"$f":"IF(D57=V57,\"OK\",\"ERRO\")","v":"OK"}]
[{"$f":"IF(A57=\"F\",A57,\"\")","v":""}]
[{"$f":"IF(A58=\"F\",A58,\"\")","v":""},null,null,null,null,null,null,null,null,null,null,null,null,0.55000000000000004,null,null,null,{"$f":"100%-(SUM(F59:Q59))","v":0.44999999999999996},null,null,null,{"$f":"IFERROR(E57/100,\"\")","v":0},null,{"$f":"IF(E57=V59*100,\"OK\",\"ERRO\")","v":"OK"}]
[{"$f":"IF(D60>0,\"F\",\"\")","v":""},"ESQUADRIAS DE MADEIRA",null,{"$f":"Orçamento!V962","v":0},{"$f":"Orçamento!X962","v":0},{"$f":"ROUND(F62*$D$60,2)","v":0},null,null,null,{"$f":"ROUND(J62*$D$60,2)","v":0},null,null,null,{"$f":"ROUND(N62*$D$60,2)","v":0},null,null,null,{"$f":"ROUND(R62*$D$60,2)","v":0},null,null,null,{"$f":"SUM(F60:U60)","v":0},null,{"$f":"IF(D60=V60,\"OK\",\"ERRO\")","v":"OK"}]
[{"$f":"IF(A60=\"F\",A60,\"\")","v":""}]
[{"$f":"IF(A61=\"F\",A61,\"\")","v":""},null,null,null,null,null,null,null,null,null,null,null,null,0.55000000000000004,null,null,null,{"$f":"100%-(SUM(F62:Q62))","v":0.44999999999999996},null,null,null,{"$f":"IFERROR(E60/100,\"\")","v":0},null,{"$f":"IF(E60=V62*100,\"OK\",\"ERRO\")","v":"OK"}]
[{"$f":"IF(D63>0,\"F\",\"\")","v":""},"ESQUADRIAS METÁLICAS",null,{"$f":"Orçamento!V963","v":0},{"$f":"Orçamento!X963","v":0},{"$f":"ROUND(F65*$D$63,2)","v":0},null,null,null,{"$f":"ROUND(J65*$D$63,2)","v":0},null,null,null,{"$f":"ROUND(N65*$D$63,2)","v":0},null,null,null,{"$f":"ROUND(R65*$D$63,2)","v":0},null,null,null,{"$f":"SUM(F63:U63)","v":0},null,{"$f":"IF(D63=V63,\"OK\",\"ERRO\")","v":"OK"}]
[{"$f":"IF(A63=\"F\",A63,\"\")","v":""}]
[{"$f":"IF(A64=\"F\",A64,\"\")","v":""},null,null,null,null,null,null,null,null,null,null,null,null,0.55000000000000004,null,null,null,{"$f":"100%-(SUM(F65:Q65))","v":0.44999999999999996},null,null,null,{"$f":"IFERROR(E63/100,\"\")","v":0},null,{"$f":"IF(E63=V65*100,\"OK\",\"ERRO\")","v":"OK"}]
[{"$f":"IF(D66>0,\"F\",\"\")","v":""},"VIDROS",null,{"$f":"Orçamento!V964","v":0},{"$f":"Orçamento!X964","v":0},{"$f":"ROUND(F68*$D$66,2)","v":0},null,null,null,{"$f":"ROUND(J68*$D$66,2)","v":0},null,null,null,{"$f":"ROUND(N68*$D$66,2)","v":0},null,null,null,{"$f":"ROUND(R68*$D$66,2)","v":0},null,null,null,{"$f":"SUM(F66:U66)","v":0},null,{"$f":"IF(D66=V66,\"OK\",\"ERRO\")","v":"OK"}]
[{"$f":"IF(A66=\"F\",A66,\"\")","v":""}]
[{"$f":"IF(A67=\"F\",A67,\"\")","v":""},null,null,null,null,null,null,null,null,null,null,null,null,0,null,null,null,1,null,null,null,{"$f":"IFERROR(E66/100,\"\")","v":0},null,{"$f":"IF(E66=V68*100,\"OK\",\"ERRO\")","v":"OK"}]
[{"$f":"IF(D69>0,\"F\",\"\")","v":""},"REVESTIMENTO DE PAREDE",null,{"$f":"Orçamento!V965","v":0},{"$f":"Orçamento!X965","v":0},{"$f":"ROUND(F71*$D$69,2)","v":0},null,null,null,{"$f":"ROUND(J71*$D$69,2)","v":0},null,null,null,{"$f":"ROUND(N71*$D$69,2)","v":0},null,null,null,{"$f":"ROUND(R71*$D$69,2)","v":0},null,null,null,{"$f":"SUM(F69:U69)","v":0},null,{"$f":"IF(D69=V69,\"OK\",\"ERRO\")","v":"OK"}]
[{"$f":"IF(A69=\"F\",A69,\"\")","v":""}]
[{"$f":"IF(A70=\"F\",A70,\"\")","v":""},null,null,null,null,null,null,null,null,null,null,null,null,1,null,null,null,{"$f":"100%-(SUM(F71:Q71))","v":0},null,null,null,{"$f":"IFERROR(E69/100,\"\")","v":0},null,{"$f":"IF(E69=V71*100,\"OK\",\"ERRO\")","v":"OK"}]
[{"$f":"IF(D72>0,\"F\",\"\")","v":""},"FORROS",null,{"$f":"Orçamento!V966","v":0},{"$f":"Orçamento!X966","v":0},{"$f":"ROUND(F74*$D$72,2)","v":0},null,null,null,{"$f":"ROUND(J74*$D$72,2)","v":0},null,null,null,{"$f":"ROUND(N74*$D$72,2)","v":0},null,null,null,{"$f":"ROUND(R74*$D$72,2)","v":0},null,null,null,{"$f":"SUM(F72:U72)","v":0},null,{"$f":"IF(D72=V72,\"OK\",\"ERRO\")","v":"OK"}]
[{"$f":"IF(A72=\"F\",A72,\"\")","v":""}]
[{"$f":"IF(A73=\"F\",A73,\"\")","v":""},null,null,null,null,null,null,null,null,null,null,null,null,0.4,null,null,null,{"$f":"100%-(SUM(F74:Q74))","v":0.6},null,null,null,{"$f":"IFERROR(E72/100,\"\")","v":0},null,{"$f":"IF(E72=V74*100,\"OK\",\"ERRO\")","v":"OK"}]
[{"$f":"IF(D75>0,\"F\",\"\")","v":""},"REVESTIMENTO DE PISO",null,{"$f":"Orçamento!V967","v":0},{"$f":"Orçamento!X967","v":0},{"$f":"ROUND(F77*$D$75,2)","v":0},null,null,null,{"$f":"ROUND(J77*$D$75,2)","v":0},null,null,null,{"$f":"ROUND(N77*$D$75,2)","v":0},null,null,null,{"$f":"ROUND(R77*$D$75,2)","v":0},null,null,null,{"$f":"SUM(F75:U75)","v":0},null,{"$f":"IF(D75=V75,\"OK\",\"ERRO\")","v":"OK"}]
[{"$f":"IF(A75=\"F\",A75,\"\")","v":""}]
[{"$f":"IF(A76=\"F\",A76,\"\")","v":""},null,null,null,null,null,null,null,null,null,null,null,null,0.4,null,null,null,{"$f":"100%-(SUM(F77:Q77))","v":0.6},null,null,null,{"$f":"IFERROR(E75/100,\"\")","v":0},null,{"$f":"IF(E75=V77*100,\"OK\",\"ERRO\")","v":"OK"}]
[{"$f":"IF(D78>0,\"F\",\"\")","v":""},"FERRAGENS",null,{"$f":"Orçamento!V968","v":0},{"$f":"Orçamento!X968","v":0},{"$f":"ROUND(F80*$D$78,2)","v":0},null,null,null,{"$f":"ROUND(J80*$D$78,2)","v":0},null,null,null,{"$f":"ROUND(N80*$D$78,2)","v":0},null,null,null,{"$f":"ROUND(R80*$D$78,2)","v":0},null,null,null,{"$f":"SUM(F78:U78)","v":0},null,{"$f":"IF(D78=V78,\"OK\",\"ERRO\")","v":"OK"}]
[{"$f":"IF(A78=\"F\",A78,\"\")","v":""}]
[{"$f":"IF(A79=\"F\",A79,\"\")","v":""},null,null,null,null,null,null,null,null,null,null,null,null,null,null,null,null,{"$f":"100%-(SUM(F80:Q80))","v":1},null,null,null,{"$f":"IFERROR(E78/100,\"\")","v":0},null,{"$f":"IF(E78=V80*100,\"OK\",\"ERRO\")","v":"OK"}]
[{"$f":"IF(D81>0,\"F\",\"\")","v":""},"MARCENARIA",null,{"$f":"Orçamento!V969","v":0},{"$f":"Orçamento!X969","v":0},{"$f":"ROUND(F83*$D$81,2)","v":0},null,null,null,{"$f":"ROUND(J83*$D$81,2)","v":0},null,null,null,{"$f":"ROUND(N83*$D$81,2)","v":0},null,null,null,{"$f":"ROUND(R83*$D$81,2)","v":0},null,null,null,{"$f":"SUM(F81:U81)","v":0},null,{"$f":"IF(D81=V81,\"OK\",\"ERRO\")","v":"OK"}]
[{"$f":"IF(A81=\"F\",A81,\"\")","v":""}]
[{"$f":"IF(A82=\"F\",A82,\"\")","v":""},null,null,null,null,null,null,null,null,null,null,null,null,null,null,null,null,{"$f":"100%-(SUM(F83:Q83))","v":1},null,null,null,{"$f":"IFERROR(E81/100,\"\")","v":0},null,{"$f":"IF(E81=V83*100,\"OK\",\"ERRO\")","v":"OK"}]
[{"$f":"IF(D84>0,\"F\",\"\")","v":""},"ADMINISTRAÇÃO - MENSALISTAS",null,{"$f":"Orçamento!V970","v":0},{"$f":"Orçamento!X970","v":0},{"$f":"ROUND(F86*$D$84,2)","v":0},null,null,null,{"$f":"ROUND(J86*$D$84,2)","v":0},null,null,null,{"$f":"ROUND(N86*$D$84,2)","v":0},null,null,null,{"$f":"ROUND(R86*$D$84,2)","v":0},null,null,null,{"$f":"SUM(F84:U84)","v":0},null,{"$f":"IF(D84=V84,\"OK\",\"ERRO\")","v":"OK"}]
[{"$f":"IF(A84=\"F\",A84,\"\")","v":""}]
[{"$f":"IF(A85=\"F\",A85,\"\")","v":""},null,null,null,null,0.25030000000000002,null,null,null,{"$f":"F86","v":0.25030000000000002},null,null,null,{"$f":"J86","v":0.25030000000000002},null,null,null,{"$f":"100%-(SUM(F86:Q86))","v":0.24909999999999988},null,null,null,{"$f":"IFERROR(E84/100,\"\")","v":0},null,{"$f":"IF(E84=V86*100,\"OK\",\"ERRO\")","v":"OK"}]
[{"$f":"IF(D87>0,\"F\",\"\")","v":""},"PINTURA",null,{"$f":"Orçamento!V971","v":0},{"$f":"Orçamento!X971","v":0},{"$f":"ROUND(F89*$D$87,2)","v":0},null,null,null,{"$f":"ROUND(J89*$D$87,2)","v":0},null,null,null,{"$f":"ROUND(N89*$D$87,2)","v":0},null,null,null,{"$f":"ROUND(R89*$D$87,2)","v":0},null,null,null,{"$f":"SUM(F87:U87)","v":0},null,{"$f":"IF(D87=V87,\"OK\",\"ERRO\")","v":"OK"}]
[{"$f":"IF(A87=\"F\",A87,\"\")","v":""}]
[{"$f":"IF(A88=\"F\",A88,\"\")","v":""},null,null,null,null,null,null,null,null,null,null,null,null,0.36,null,null,null,{"$f":"100%-(SUM(F89:Q89))","v":0.64},null,null,null,{"$f":"IFERROR(E87/100,\"\")","v":0},null,{"$f":"IF(E87=V89*100,\"OK\",\"ERRO\")","v":"OK"}]
[{"$f":"IF(D90>0,\"F\",\"\")","v":""},"DIVERSOS",null,{"$f":"Orçamento!V972","v":0},{"$f":"Orçamento!X972","v":0},{"$f":"ROUND(F92*$D$90,2)","v":0},null,null,null,{"$f":"ROUND(J92*$D$90,2)","v":0},null,null,null,{"$f":"ROUND(N92*$D$90,2)","v":0},null,null,null,{"$f":"ROUND(R92*$D$90,2)","v":0},null,null,null,{"$f":"SUM(F90:U90)","v":0},null,{"$f":"IF(D90=V90,\"OK\",\"ERRO\")","v":"OK"}]
[{"$f":"IF(A90=\"F\",A90,\"\")","v":""}]
[{"$f":"IF(A91=\"F\",A91,\"\")","v":""},null,null,null,null,0.251,null,null,null,0.255,null,null,null,0.255,null,null,null,{"$f":"100%-(SUM(F92:Q92))","v":0.23899999999999999},null,null,null,{"$f":"IFERROR(E90/100,\"\")","v":0},null,{"$f":"IF(E90=V92*100,\"OK\",\"ERRO\")","v":"OK"}]
["F","CUSTO DO ORÇAMENTO",null,{"$f":"SUM(D15:D92)","v":0},{"$f":"SUM(E15:E92)","v":0},{"$f":"F15+F18+F21+F24+F27+F30+F33+F36+F39+F42+F45+F48+F51+F54+F57+F60+F63+F66+F69+F72+F75+F78+F81+F84+F87+F90","v":0},null,null,null,{"$f":"J15+J18+J21+J24+J27+J30+J33+J36+J39+J42+J45+J48+J51+J54+J57+J60+J63+J66+J69+J72+J75+J78+J81+J84+J87+J90","v":0},null,null,null,{"$f":"N15+N18+N21+N24+N27+N30+N33+N36+N39+N42+N45+N48+N51+N54+N57+N60+N63+N66+N69+N72+N75+N78+N81+N84+N87+N90","v":0},null,null,null,{"$f":"R15+R18+R21+R24+R27+R30+R33+R36+R39+R42+R45+R48+R51+R54+R57+R60+R63+R66+R69+R72+R75+R78+R81+R84+R87+R90","v":0},null,null,null,{"$f":"V15+V18+V21+V24+V27+V30+V33+V36+V39+V42+V45+V48+V51+V54+V57+V60+V63+V66+V69+V72+V75+V78+V81+V84+V87+V90","v":0}]
["F","PERCENTUAIS:",null,null,null,{"$f":"IFERROR(F93/$D$93,\"\")","v":""},null,null,null,{"$f":"IFERROR(J93/$D$93,\"\")","v":""},null,null,null,{"$f":"IFERROR(N93/$D$93,\"\")","v":""},null,null,null,{"$f":"IFERROR(R93/$D$93,\"\")","v":""},null,null,null,{"$f":"SUM(F94:U94)","v":0}]
["F","TOTAIS ACUMULADOS:",null,null,null,{"$f":"F93","v":0},null,null,null,{"$f":"J93+F95","v":0},null,null,null,{"$f":"N93+J95","v":0},null,null,null,{"$f":"R93+N95","v":0}]
["F","PERCENTUAIS  ACUMULADOS:",null,null,null,{"$f":"F94","v":""},null,null,null,{"$f":"J94+F96","v":{"$error":"#VALUE!"}},null,null,null,{"$f":"N94+J96","v":{"$error":"#VALUE!"}},null,null,null,{"$f":"R94+N96","v":{"$error":"#VALUE!"}}]
["F"]
["F","OBSERVAÇÕES:"]
["F","Os pagamentos somente poderão ser efetuados mediante medição e atesto pelos técnicos da Secretaria da Educação. "]

{"sheet":"Composição BDI","index":4,"n_rows":45,"n_cols":9,"rows_kept":45,"cut":false,"hidden":false,"merged":[[11,0,11,3],[12,0,12,3],[14,0,14,3],[15,0,15,3],[13,0,13,3],[0,0,0,3],[1,0,1,3],[4,0,4,3],[7,0,7,3],[10,0,10,3],[2,0,2,3],[3,0,3,3],[5,0,5,3],[6,0,6,3],[8,0,8,3],[9,0,9,3],[18,5,18,8],[17,0,17,3],[16,0,16,3],[44,0,44,3],[42,0,42,3],[43,0,43,3],[18,0,18,3],[36,0,36,3],[39,0,39,3],[38,0,38,3],[40,0,40,3],[29,0,29,2],[32,0,32,3],[33,0,33,3],[34,0,34,3],[35,0,35,3]]}
[]
[]
["UNIDADE ESCOLAR"]
[{"$f":"Orçamento!$O$4","v":"CENTRO DE ENSINO EM PERÍODO INTEGRAL SYLVIO DE MELLO"}]
[]
["OBRA"]
[{"$f":"Orçamento!$O$7","v":"REFORMA"}]
[]
["ENDEREÇO"]
[{"$f":"Orçamento!$R$10","v":"RUA PIAUI 386, CENTRO, CEP:75650-000"}]
[]
["CIDADE"]
[{"$f":"Orçamento!$V$7","v":"MORRINHOS"}]
[]
["CRE"]
[{"$f":"Orçamento!$O$10","v":"MORRINHOS"}]
[]
["DETALHAMENTO DA COMPOSIÇÃO DE BDI"]
["COMPOSIÇÃO BDI PARA OBRAS CIVIS",null,null,null,null,"BDI CONSTRUÇÃO E REFORMA"]
["DESCRIÇÃO","COEF.","TAXA % (a.m)","% no preço de venda",null,"Situação","1º Quartil","Médio","3º Quartil"]
["1) COFINS",1,0.03,{"$f":"C21","v":0.03},null,{"$f":"IF(OR(C21<G21,C21>I21),\"FORA DO INTERVALO\",\"OK\")","v":"OK"},0.03,0.03,0.03]
["2) PIS",1,6.4999999999999997E-3,{"$f":"C22","v":6.4999999999999997E-3},null,{"$f":"IF(OR(C22<G22,C22>I22),\"FORA DO INTERVALO\",\"OK\")","v":"OK"},6.4999999999999997E-3,6.4999999999999997E-3,6.4999999999999997E-3]
["3) ISSQN",1,2.894E-2,{"$f":"C23*B23","v":2.894E-2},null,"OK",0.02,3.5000000000000003E-2,0.05]
["4) CPRB",1,4.4999999999999998E-2,{"$f":"C24","v":4.4999999999999998E-2},null,"OK",4.4999999999999998E-2,4.4999999999999998E-2,4.4999999999999998E-2]
["5) Administração Central",1,0.04,0.04,null,"OK",0.03,0.04,5.5E-2]
["6) Despesas Financeiras",1,5.5999999999999999E-3,5.5999999999999999E-3,null,"FORA DO INTERVALO",5.8999999999999999E-3,1.23E-2,1.3899999999999999E-2]
["7) Seguros + Garantias",1,1.1999999999999999E-3,1.1999999999999999E-3,null,"FORA DO INTERVALO",8.0000000000000002E-3,8.0000000000000002E-3,0.01]
["8) Risco",1,9.7000000000000003E-3,9.7000000000000003E-3,null,"OK",9.7000000000000003E-3,1.2699999999999999E-2,1.2699999999999999E-2]
["9) Lucro",1,6.4199999999999993E-2,6.4199999999999993E-2,null,"OK",6.1600000000000002E-2,7.3999999999999996E-2,8.9599999999999999E-2]
["BDI - FINAL",null,null,{"$f":"(((1+D25+D27+D28)*(1+D26)*(1+D29))/(1-(D21+D22+D23+D24))-1)","v":0.26425495702144919},null,{"$f":"IF(OR(D30<G30,D30>I30),\"FORA DO INTERVALO\",\"OK\")","v":"FORA DO INTERVALO"},0.2034,0.22120000000000001,0.25]
[]
["Notas:"]
["(1) e (2) Alíquota definida por lei."]
["(3) Alíquota e base de cálculo definidas pela legislação municipal."]
["(4) Alíquota definida pelas leis 12.546/11, 12844/13 e 13.161/15 (CPRB – contribuição previdenciária sobre a receita bruta)."]
["(5) Valores definidos a partir dos limites no Acórdão nº 2.622/2013 - TCU – Plenário. Valores entre o 1º e 3º quartis."]
["(6) Valor calculado pela expressão matemática do acórdão 2.369/2011 – TCU – Plenário e disponibilizado pela AGETOP em dezembro de 2018. (Foi utilizado para o cálculo a média da Taxa SELIC no período de 11/2017 a 10/2018)"]
[]
["(7) Valores definidos pela AGETOP a partir dos limites no Acórdão nº 2.622/2013 - TCU – Plenário. Valores médios. \n\nObservação da AGETOP: (Seguros contra erros de execução, incêndio e explosão, danos da natureza (vendaval, destelhamento, alagamento, inundação, desmoronamento, geadas etc.), emprego de material defeituoso ou inadequado, roubo e/ou furto qualificado, quebra de equipamentos, desmoronamento de estrutura, nas modalidades de Obras Civis em Construção (OCC); Instalação e Montagem (IM); e Obras Civis em Construção e Instalação e Montagem (OCC/IM). Bem como coberturas adicionais para ampliação dessas coberturas básicas, como: cobertura de responsabilidade civil geral, cobertura de responsabilidade civil cruzada, cobertura de despesas extraordinárias, cobertura de tumultos, cobertura de desentulho do local, cobertura de riscos do fabricante, dentre outras, incluindo o seguro de vida em grupo regido pela convenção coletiva dos trabalhadores na indústria da construção civil). A partir de 24/02/2015 por intermédio da Portaria 449/2015 a Presidência da AGETOP, na pessoa do Senhor Jayme Eduardo Rincon, determinou a exclusão dos valores referentes aos Seguros de Risco de Engenharia e Responsabilidade Civil do Profissional na composição do cálculo do B.D.I.."]
["(8) Valores definidos a partir dos limites no Acórdão nº 2.622/2013 - TCU – Plenário. Valores entre 1º e 3° quartis."]
["(9) Valores definidos a partir dos limites definidos no Acórdão nº 2.622/2013 - TCU – Plenário. Valores adotados e praticados no mercado ( “ ex ante ” ) ou aqueles entre os 1º e 3º quartis."]
[]
["(*) A fórmula para estipulação da taxa de BDI estimado adotado é a mesma que foi aplicada para a obtenção das tabelas contidas no Acórdão n. 2.622/2013 – TCUPlenário"]
[]
["Obs.: Para obras com valores superiores a R$ 20.000.000,00 sugere-se recalcular o BDI, dimensionando as taxas de administração central e lucro para patamares inferiores ao estipulado acima."]

{"sheet":"Relatório CENTRAL","index":5,"n_rows":40,"n_cols":5,"rows_kept":40,"cut":false,"hidden":false,"merged":[[11,1,11,4],[39,1,39,2],[9,0,11,0],[0,1,0,4],[6,3,6,4],[9,3,9,4],[1,1,1,4],[2,1,2,2],[2,3,2,4],[3,1,3,2],[3,3,3,4],[4,1,4,4],[5,1,5,2],[5,3,5,4],[6,1,6,2],[7,1,7,4],[8,1,8,2],[8,3,8,4],[9,1,9,2],[10,1,10,4]]}
[]
[]
[null,"UNIDADE ESCOLAR",null,"CIDADE"]
[null,{"$f":"Orçamento!$O$4","v":"CENTRO DE ENSINO EM PERÍODO INTEGRAL SYLVIO DE MELLO"},null,{"$f":"Orçamento!$V$7","v":"MORRINHOS"}]
[]
[null,"OBRA",null,"CRE"]
[null,{"$f":"Orçamento!$O$7","v":"REFORMA"},null,{"$f":"Orçamento!$O$10","v":"MORRINHOS"}]
[]
[null,"ENDEREÇO",null,"DATA"]
["FILTRO",{"$f":"Orçamento!$R$10","v":"RUA PIAUI 386, CENTRO, CEP:75650-000"},null,{"$f":"Orçamento!$S$7","v":"2020-07-07"}]
[]
[null,"RELATÓRIO CENTRAL"]
["↓","CÓDIGO","ETAPA","PREÇO  (R$) C/ BDI","PARTIC  ( % )"]
[{"$f":"IF(D14>0,\"F\",\"\")","v":""},{"$f":"Orçamento!O947","v":"a."},{"$f":"Orçamento!P947","v":"SERVIÇOS PRELIMINARES"},{"$f":"Orçamento!V947","v":0},{"$f":"Orçamento!X947","v":0}]
[{"$f":"IF(D15>0,\"F\",\"\")","v":""},{"$f":"Orçamento!O948","v":"b."},{"$f":"Orçamento!P948","v":"TRANSPORTES"},{"$f":"Orçamento!V948","v":0},{"$f":"Orçamento!X948","v":0}]
["",{"$f":"Orçamento!O949","v":"c."},{"$f":"Orçamento!P949","v":"SERVIÇO EM TERRA"},{"$f":"Orçamento!V949","v":0},{"$f":"Orçamento!X949","v":0}]
["",{"$f":"Orçamento!O950","v":"d."},{"$f":"Orçamento!P950","v":"FUNDAÇÕES E SONDAGENS"},{"$f":"Orçamento!V950","v":0},{"$f":"Orçamento!X950","v":0}]
["",{"$f":"Orçamento!O951","v":"e."},{"$f":"Orçamento!P951","v":"ESTRUTURA"},{"$f":"Orçamento!V951","v":0},{"$f":"Orçamento!X951","v":0}]
["",{"$f":"Orçamento!O952","v":"f."},{"$f":"Orçamento!P952","v":"INSTALAÇÕES ELÉTRICAS"},{"$f":"Orçamento!V952","v":0},{"$f":"Orçamento!X952","v":0}]
["",{"$f":"Orçamento!O953","v":"g."},{"$f":"Orçamento!P953","v":"INSTALAÇÕES HIDROSSANITÁRIAS"},{"$f":"Orçamento!V953","v":0},{"$f":"Orçamento!X953","v":0}]
["",{"$f":"Orçamento!O954","v":"h"},{"$f":"Orçamento!P954","v":"INSTALAÇÕES ESPECIAIS"},{"$f":"Orçamento!V954","v":0},{"$f":"Orçamento!X954","v":0}]
["",{"$f":"Orçamento!O955","v":"i."},{"$f":"Orçamento!P955","v":"ALVENARIAS E DIVISÓRIAS"},{"$f":"Orçamento!V955","v":0},{"$f":"Orçamento!X955","v":0}]
["",{"$f":"Orçamento!O956","v":"j."},{"$f":"Orçamento!P956","v":"ALVENARIA AUTO-PORTANTE"},{"$f":"Orçamento!V956","v":0},{"$f":"Orçamento!X956","v":0}]
["",{"$f":"Orçamento!O957","v":"k."},{"$f":"Orçamento!P957","v":"IMPERMEABILIZAÇÃO"},{"$f":"Orçamento!V957","v":0},{"$f":"Orçamento!X957","v":0}]
["",{"$f":"Orçamento!O958","v":"l."},{"$f":"Orçamento!P958","v":"ISOLAMENTO TÉRMICO E ACÚSTICO"},{"$f":"Orçamento!V958","v":0},{"$f":"Orçamento!X958","v":0}]
["",{"$f":"Orçamento!O959","v":"m."},{"$f":"Orçamento!P959","v":"ESTRUTURA DE MADEIRA"},{"$f":"Orçamento!V959","v":0},{"$f":"Orçamento!X959","v":0}]
["",{"$f":"Orçamento!O960","v":"n."},{"$f":"Orçamento!P960","v":"ESTRUTURAS METÁLICAS"},{"$f":"Orçamento!V960","v":0},{"$f":"Orçamento!X960","v":0}]
["",{"$f":"Orçamento!O961","v":"o."},{"$f":"Orçamento!P961","v":"COBERTURAS"},{"$f":"Orçamento!V961","v":0},{"$f":"Orçamento!X961","v":0}]
["",{"$f":"Orçamento!O962","v":"p."},{"$f":"Orçamento!P962","v":"ESQUADRIAS DE MADEIRA"},{"$f":"Orçamento!V962","v":0},{"$f":"Orçamento!X962","v":0}]
["",{"$f":"Orçamento!O963","v":"q."},{"$f":"Orçamento!P963","v":"ESQUADRIAS METÁLICAS"},{"$f":"Orçamento!V963","v":0},{"$f":"Orçamento!X963","v":0}]
["",{"$f":"Orçamento!O964","v":"r."},{"$f":"Orçamento!P964","v":"VIDROS"},{"$f":"Orçamento!V964","v":0},{"$f":"Orçamento!X964","v":0}]
["",{"$f":"Orçamento!O965","v":"s."},{"$f":"Orçamento!P965","v":"REVESTIMENTO DE PAREDE"},{"$f":"Orçamento!V965","v":0},{"$f":"Orçamento!X965","v":0}]
["",{"$f":"Orçamento!O966","v":"t."},{"$f":"Orçamento!P966","v":"FORROS"},{"$f":"Orçamento!V966","v":0},{"$f":"Orçamento!X966","v":0}]
["",{"$f":"Orçamento!O967","v":"u."},{"$f":"Orçamento!P967","v":"REVESTIMENTO DE PISO"},{"$f":"Orçamento!V967","v":0},{"$f":"Orçamento!X967","v":0}]
["",{"$f":"Orçamento!O968","v":"v."},{"$f":"Orçamento!P968","v":"FERRAGENS"},{"$f":"Orçamento!V968","v":0},{"$f":"Orçamento!X968","v":0}]
["",{"$f":"Orçamento!O969","v":"w."},{"$f":"Orçamento!P969","v":"MARCENARIA"},{"$f":"Orçamento!V969","v":0},{"$f":"Orçamento!X969","v":0}]
["",{"$f":"Orçamento!O970","v":"x."},{"$f":"Orçamento!P970","v":"ADMINISTRAÇÃO"},{"$f":"Orçamento!V970","v":0},{"$f":"Orçamento!X970","v":0}]
["",{"$f":"Orçamento!O971","v":"y."},{"$f":"Orçamento!P971","v":"PINTURA"},{"$f":"Orçamento!V971","v":0},{"$f":"Orçamento!X971","v":0}]
["",{"$f":"Orçamento!O972","v":"z."},{"$f":"Orçamento!P972","v":"DIVERSOS"},{"$f":"Orçamento!V972","v":0},{"$f":"Orçamento!X972","v":0}]
["F","TOTAL GERAL DO ORÇAMENTO (R$) C/BDI",null,{"$f":"SUM(D14:D39)","v":0},{"$f":"SUM(E14:E39)","v":0}]

{"sheet":"Parc Maior Relev","index":6,"n_rows":35,"n_cols":7,"rows_kept":35,"cut":false,"hidden":false,"merged":[[0,1,0,6],[11,1,11,6],[1,1,1,6],[2,1,2,3],[2,4,2,6],[3,1,3,3],[3,4,3,6],[4,1,4,6],[5,1,5,3],[5,4,5,6],[9,1,9,3],[9,4,9,6],[10,1,10,6],[6,1,6,3],[6,4,6,6],[7,1,7,6],[8,1,8,3],[8,4,8,6],[35,3,35,7],[33,1,33,6],[10,0,11,0]]}
[]
[]
[null,"UNIDADE ESCOLAR",null,null,"CÓDIGO INEP"]
[null,{"$f":"Orçamento!$O$4","v":"CENTRO DE ENSINO EM PERÍODO INTEGRAL SYLVIO DE MELLO"},null,null,{"$f":"Orçamento!$V$4","v":52069206}]
[]
[null,"OBRA",null,null,"CIDADE"]
[null,{"$f":"Orçamento!$O$7","v":"REFORMA"},null,null,{"$f":"Orçamento!$V$7","v":"MORRINHOS"}]
[]
[null,"CRE",null,null,"ÁREA TOTAL CONSTRUÍDA (M²)"]
[null,{"$f":"Orçamento!$O$10","v":"MORRINHOS"},null,null,{"$f":"Orçamento!$V$13","v":3042.44}]
["FILTRO"]
[null,"PARCELA DE MAIOR RELEVÂNCIA"]
[{"$f":"IF(G14>0,\"F\",\"\")","v":""},"CÓDIGO","SERVIÇO","DESCRIÇÃO","UNID","QUANT","PARC. MAIOR RELEV (100%)"]
[{"$f":"IF(G14>0,\"F\",\"\")","v":""},{"$f":"Somatório!B22","v":"f."},"INSTALAÇÕES ELÉTRICAS","SUBESTAÇÃO","KVA",{"$f":"SUMIF(Orçamento!$R$20:$R$928,'Parc Maior Relev'!D14,Orçamento!$T$20:$T$928)","v":0},{"$f":"F14","v":0}]
[{"$f":"IF(SUM(G16:G32)>0,\"F\",\"\")","v":"F"},"CÓDIGO","SERVIÇO","DESCRIÇÃO","UNID","QUANT","PARC. MAIOR RELEV (50%)"]
[{"$f":"IF(G16>0,\"F\",\"\")","v":"F"},{"$f":"Somatório!B21","v":"e."},"ESTRUTURA","CONCRETO","M3",{"$f":"1.69+0.74+2.25+1.08+1.31+0.56+0.77+0.74+1.95+0.94+0.49+0.99+0.47+0.11+1.29+2.14+5.66+1.9+3.83+2.52","v":31.429999999999996},{"$f":"F16*0.5","v":15.714999999999998}]
[{"$f":"IF(G17>0,\"F\",\"\")","v":""},"f.","INSTALAÇÕES ELÉTRICAS","INSTALAÇÕES ELÉTRICAS","KVA",{"$f":"SUMIF(Orçamento!$R$20:$R$928,'Parc Maior Relev'!D17,Orçamento!$T$20:$T$928)","v":0},{"$f":"F17","v":0}]
[{"$f":"IF(G18>0,\"F\",\"\")","v":"F"},{"$f":"Somatório!B25","v":"i."},"ALVENARIA E DIVISÓRIAS","ALVENARIA DE TIJOLOS","M2",{"$f":"7.22+1.15+5.95+40.1+3.78+72.8+36.31+16.53+16.25+137.08+60.94+72.45","v":470.56},{"$f":"F18*0.5","v":235.28}]
["",{"$f":"Somatório!B29","v":"m."},"ESTRUTURA DE MADEIRA","ESTRUTURA DE MADEIRA","M2",{"$f":"SUMIF(Orçamento!$R$20:$R$928,'Parc Maior Relev'!D19,Orçamento!$T$20:$T$928)","v":0},0]
["",{"$f":"Somatório!B31","v":"o."},"COBERTURAS","COBERTURA CERÂMICA","M2",{"$f":"SUMIF(Orçamento!$R$20:$R$928,'Parc Maior Relev'!D20,Orçamento!$T$20:$T$928)","v":0},0]
["","o.","COBERTURAS","COBERTURA COM TELHA METÁLICA","M2",{"$f":"SUMIF(Orçamento!$R$20:$R$928,'Parc Maior Relev'!D21,Orçamento!$T$20:$T$928)","v":0},0]
["",{"$f":"Somatório!B35","v":"s."},"REVESTIMENTO DE PAREDE","CHAPISCO","M2",{"$f":"SUMIF(Orçamento!$R$20:$R$928,'Parc Maior Relev'!D22,Orçamento!$T$20:$T$928)","v":0},0]
["","s.","REVESTIMENTO DE PAREDE","REBOCO","M2",{"$f":"SUMIF(Orçamento!$R$20:$R$928,'Parc Maior Relev'!D23,Orçamento!$T$20:$T$928)","v":0},{"$f":"F23*0.5","v":0}]
["F","s.","REVESTIMENTO DE PAREDE","REVESTIMENTO CERÂMICO","M2",{"$f":"73.74+328.6+310.48+20+145","v":877.82},{"$f":"F24*0.5","v":438.91}]
["",{"$f":"Somatório!B36","v":"t."},"FORROS","FORRO DE GESSO","M2",{"$f":"SUMIF(Orçamento!$R$20:$R$928,'Parc Maior Relev'!D25,Orçamento!$T$20:$T$928)","v":0},{"$f":"F25*0.5","v":0}]
["","t.","FORROS","FORRO DE PVC","M2",{"$f":"SUMIF(Orçamento!$R$20:$R$928,'Parc Maior Relev'!D26,Orçamento!$T$20:$T$928)","v":0},{"$f":"F26*0.5","v":0}]
["","t.","FORROS","FORRO DE GESSO ACARTONADO","M2",{"$f":"SUMIF(Orçamento!$R$20:$R$928,'Parc Maior Relev'!D27,Orçamento!$T$20:$T$928)","v":0},{"$f":"F27*0.5","v":0}]
["","u.","REVESTIMENTO DE PISO","PISO DE GRANITINA","M2",{"$f":"SUMIF(Orçamento!$R$20:$R$928,'Parc Maior Relev'!D28,Orçamento!$T$20:$T$928)","v":0},0]
["F","u.","REVESTIMENTO DE PISO","PISO LAMINADO","M2",{"$f":"560.23","v":560.23},280.11500000000001]
["","u.","REVESTIMENTO DE PISO","PISO DE CONCRETO DESEMPENADO","M2",{"$f":"SUMIF(Orçamento!$R$20:$R$928,'Parc Maior Relev'!D30,Orçamento!$T$20:$T$928)","v":0},0]
["","u.","REVESTIMENTO DE PISO","PISO CERÂMICO","M2",{"$f":"SUMIF(Orçamento!$R$20:$R$928,'Parc Maior Relev'!D31,Orçamento!$T$20:$T$928)","v":0},{"$f":"F31*0.5","v":0}]
["","y.","PINTURA","PINTURA","M2",{"$f":"SUMIF(Orçamento!$R$20:$R$928,'Parc Maior Relev'!D32,Orçamento!$T$20:$T$928)","v":0},0]
["F"]
["F","(*) Para os fins do inciso I dp § 1º do Art. 30 da Lei Federal 8.666/93, são consideradas parcelas de maior relevância técnica as execuções apresentadas"]
["F"]

{"sheet":"Composições","index":7,"n_rows":458,"n_cols":10,"rows_kept":458,"cut":false,"hidden":false,"merged":[[449,5,450,5],[449,6,449,7],[449,8,449,9],[453,1,453,7],[457,1,457,7],[449,0,450,0],[449,1,450,1],[449,2,450,2],[449,3,450,3],[449,4,450,4],[436,5,437,5],[436,6,436,7],[436,8,436,9],[440,1,440,7],[447,1,447,7],[436,0,437,0],[436,1,437,1],[436,2,437,2],[436,3,437,3],[436,4,437,4],[426,5,427,5],[426,6,426,7],[426,8,426,9],[430,1,430,7],[434,1,434,7],[426,0,427,0],[426,1,427,1],[426,2,427,2],[426,3,427,3],[426,4,427,4],[416,5,417,5],[416,6,416,7],[416,8,416,9],[420,1,420,7],[424,1,424,7],[416,0,417,0],[416,1,417,1],[416,2,417,2],[416,3,417,3],[416,4,417,4],[407,5,408,5],[407,6,407,7],[407,8,407,9],[412,1,412,7],[414,1,414,7],[407,0,408,0],[407,1,408,1],[407,2,408,2],[407,3,408,3],[407,4,408,4],[398,5,399,5],[398,6,398,7],[398,8,398,9],[403,1,403,7],[405,1,405,7],[398,0,399,0],[398,1,399,1],[398,2,399,2],[398,3,399,3],[398,4,399,4],[389,5,390,5],[389,6,389,7],[389,8,389,9],[394,1,394,7],[396,1,396,7],[389,0,390,0],[389,1,390,1],[389,2,390,2],[389,3,390,3],[389,4,390,4],[380,5,381,5],[380,6,380,7],[380,8,380,9],[385,1,385,7],[387,1,387,7],[380,0,381,0],[380,1,381,1],[380,2,381,2],[380,3,381,3],[380,4,381,4],[371,5,372,5],[371,6,371,7],[371,8,371,9],[376,1,376,7],[378,1,378,7],[371,0,372,0],[371,1,372,1],[371,2,372,2],[371,3,372,3],[371,4,372,4],[364,5,365,5],[364,6,364,7],[364,8,364,9],[367,1,367,7],[369,1,369,7],[364,0,365,0],[364,1,365,1],[364,2,365,2],[364,3,365,3],[364,4,365,4],[354,5,355,5],[354,6,354,7],[354,8,354,9],[359,1,359,7],[362,1,362,7],[354,0,355,0],[354,1,355,1],[354,2,355,2],[354,3,355,3],[354,4,355,4],[334,5,335,5],[334,6,334,7],[334,8,334,9],[339,1,339,7],[352,1,352,7],[334,0,335,0],[334,1,335,1],[334,2,335,2],[334,3,335,3],[334,4,335,4],[314,5,315,5],[314,6,314,7],[314,8,314,9],[319,1,319,7],[332,1,332,7],[314,0,315,0],[314,1,315,1],[314,2,315,2],[314,3,315,3],[314,4,315,4],[304,5,305,5],[304,6,304,7],[304,8,304,9],[308,1,308,7],[312,1,312,7],[304,0,305,0],[304,1,305,1],[304,2,305,2],[304,3,305,3],[304,4,305,4],[294,5,295,5],[294,6,294,7],[294,8,294,9],[298,1,298,7],[302,1,302,7],[294,0,295,0],[294,1,295,1],[294,2,295,2],[294,3,295,3],[294,4,295,4],[284,5,285,5],[284,6,284,7],[284,8,284,9],[288,1,288,7],[292,1,292,7],[284,0,285,0],[284,1,285,1],[284,2,285,2],[284,3,285,3],[284,4,285,4],[271,5,272,5],[271,6,271,7],[271,8,271,9],[275,1,275,7],[282,1,282,7],[271,0,272,0],[271,1,272,1],[271,2,272,2],[271,3,272,3],[271,4,272,4],[261,5,262,5],[261,6,261,7],[261,8,261,9],[265,1,265,7],[269,1,269,7],[261,0,262,0],[261,1,262,1],[261,2,262,2],[261,3,262,3],[261,4,262,4],[251,5,252,5],[251,6,251,7],[251,8,251,9],[255,1,255,7],[259,1,259,7],[251,0,252,0],[251,1,252,1],[251,2,252,2],[251,3,252,3],[251,4,252,4],[242,5,243,5],[242,6,242,7],[242,8,242,9],[247,1,247,7],[249,1,249,7],[242,0,243,0],[242,1,243,1],[242,2,243,2],[242,3,243,3],[242,4,243,4],[233,5,234,5],[233,6,233,7],[233,8,233,9],[238,1,238,7],[240,1,240,7],[233,0,234,0],[233,1,234,1],[233,2,234,2],[233,3,234,3],[233,4,234,4],[224,5,225,5],[224,6,224,7],[224,8,224,9],[229,1,229,7],[231,1,231,7],[224,0,225,0],[224,1,225,1],[224,2,225,2],[224,3,225,3],[224,4,225,4],[215,5,216,5],[215,6,215,7],[215,8,215,9],[220,1,220,7],[222,1,222,7],[215,0,216,0],[215,1,216,1],[215,2,216,2],[215,3,216,3],[215,4,216,4],[207,5,208,5],[207,6,207,7],[207,8,207,9],[211,1,211,7],[213,1,213,7],[207,0,208,0],[207,1,208,1],[207,2,208,2],[207,3,208,3],[207,4,208,4],[197,5,198,5],[197,6,197,7],[197,8,197,9],[202,1,202,7],[205,1,205,7],[197,0,198,0],[197,1,198,1],[197,2,198,2],[197,3,198,3],[197,4,198,4],[187,5,188,5],[187,6,187,7],[187,8,187,9],[192,1,192,7],[195,1,195,7],[187,0,188,0],[187,1,188,1],[187,2,188,2],[187,3,188,3],[187,4,188,4],[177,5,178,5],[177,6,177,7],[177,8,177,9],[182,1,182,7],[185,1,185,7],[177,0,178,0],[177,1,178,1],[177,2,178,2],[177,3,178,3],[177,4,178,4],[167,5,168,5],[167,6,167,7],[167,8,167,9],[172,1,172,7],[175,1,175,7],[167,0,168,0],[167,1,168,1],[167,2,168,2],[167,3,168,3],[167,4,168,4],[159,5,160,5],[159,6,159,7],[159,8,159,9],[163,1,163,7],[165,1,165,7],[159,0,160,0],[159,1,160,1],[159,2,160,2],[159,3,160,3],[159,4,160,4],[150,5,151,5],[150,6,150,7],[150,8,150,9],[155,1,155,7],[157,1,157,7],[150,0,151,0],[150,1,151,1],[150,2,151,2],[150,3,151,3],[150,4,151,4],[141,5,142,5],[141,6,141,7],[141,8,141,9],[146,1,146,7],[148,1,148,7],[141,0,142,0],[141,1,142,1],[141,2,142,2],[141,3,142,3],[141,4,142,4],[131,5,132,5],[131,6,131,7],[131,8,131,9],[135,1,135,7],[139,1,139,7],[131,0,132,0],[131,1,132,1],[131,2,132,2],[131,3,132,3],[131,4,132,4],[121,5,122,5],[121,6,121,7],[121,8,121,9],[125,1,125,7],[129,1,129,7],[121,0,122,0],[121,1,122,1],[121,2,122,2],[121,3,122,3],[121,4,122,4],[111,5,112,5],[111,6,111,7],[111,8,111,9],[116,1,116,7],[119,1,119,7],[111,0,112,0],[111,1,112,1],[111,2,112,2],[111,3,112,3],[111,4,112,4],[101,5,102,5],[101,6,101,7],[101,8,101,9],[106,1,106,7],[109,1,109,7],[101,0,102,0],[101,1,102,1],[101,2,102,2],[101,3,102,3],[101,4,102,4],[92,5,93,5],[92,6,92,7],[92,8,92,9],[97,1,97,7],[99,1,99,7],[92,0,93,0],[92,1,93,1],[92,2,93,2],[92,3,93,3],[92,4,93,4],[83,5,84,5],[83,6,83,7],[83,8,83,9],[88,1,88,7],[90,1,90,7],[83,0,84,0],[83,1,84,1],[83,2,84,2],[83,3,84,3],[83,4,84,4],[74,5,75,5],[74,6,74,7],[74,8,74,9],[79,1,79,7],[81,1,81,7],[74,0,75,0],[74,1,75,1],[74,2,75,2],[74,3,75,3],[74,4,75,4],[65,5,66,5],[65,6,65,7],[65,8,65,9],[70,1,70,7],[72,1,72,7],[65,0,66,0],[65,1,66,1],[65,2,66,2],[65,3,66,3],[65,4,66,4],[56,5,57,5],[56,6,56,7],[56,8,56,9],[61,1,61,7],[63,1,63,7],[56,0,57,0],[56,1,57,1],[56,2,57,2],[56,3,57,3],[56,4,57,4],[46,5,47,5],[46,6,46,7],[46,8,46,9],[51,1,51,7],[54,1,54,7],[46,0,47,0],[46,1,47,1],[46,2,47,2],[46,3,47,3],[46,4,47,4],[36,5,37,5],[36,6,36,7],[36,8,36,9],[41,1,41,7],[44,1,44,7],[36,0,37,0],[36,1,37,1],[36,2,37,2],[36,3,37,3],[36,4,37,4],[24,5,25,5],[24,6,24,7],[24,8,24,9],[33,1,33,7],[34,1,34,7],[24,0,25,0],[24,1,25,1],[24,2,25,2],[24,3,25,3],[24,4,25,4],[16,5,17,5],[16,6,16,7],[16,8,16,9],[20,1,20,7],[22,1,22,7],[16,0,17,0],[16,1,17,1],[16,2,17,2],[16,3,17,3],[16,4,17,4],[15,0,15,9],[13,0,13,2],[13,3,13,6],[1,0,1,9],[3,7,3,9],[4,7,4,9],[6,7,6,9],[7,7,7,9],[6,0,6,6],[10,8,10,9],[13,8,13,9],[14,0,14,9],[8,0,8,9],[5,0,5,9],[2,0,2,9],[0,0,0,8],[10,0,10,2],[10,3,10,6],[11,0,11,9],[12,0,12,2],[12,3,12,6],[12,7,12,8],[7,0,7,6],[9,0,9,2],[9,3,9,6],[9,7,9,8],[3,0,3,6],[4,0,4,6]]}
[]
[]
[]
["UNIDADE ESCOLAR",null,null,null,null,null,null,"CÓDIGO INEP"]
[{"$f":"Orçamento!$O$4","v":"CENTRO DE ENSINO EM PERÍODO INTEGRAL SYLVIO DE MELLO"},null,null,null,null,null,null,{"$f":"Orçamento!$V$4","v":52069206}]
[]
["OBRA",null,null,null,null,null,null,"CIDADE"]
[{"$f":"Orçamento!$O$7","v":"REFORMA"},null,null,null,null,null,null,{"$f":"Orçamento!$V$7","v":"MORRINHOS"}]
[]
["CRE",null,null,"ENDEREÇO",null,null,null,"REFERÊNCIA AGETOP"]
[{"$f":"Orçamento!$O$10","v":"MORRINHOS"},null,null,{"$f":"Orçamento!$R$10","v":"RUA PIAUI 386, CENTRO, CEP:75650-000"},null,null,null,{"$f":"Orçamento!$S$10","v":"ABR/19"},{"$f":"Orçamento!$T$10","v":"DESONERADA"}]
[]
["DATA",null,null,"ÁREA TOTAL CONSTRUÍDA (M²)",null,null,null,"REFERÊNCIA SINAPI"]
[{"$f":"Orçamento!$S$7","v":"2020-07-07"},null,null,{"$f":"Orçamento!$V$13","v":3042.44},null,null,null,{"$f":"Orçamento!$V$10","v":"NOV/19"},{"$f":"Orçamento!$W$10","v":"DESONERADA"}]
[]
["COMPOSIÇÕES DE CUSTOS UNITÁRIOS - SEE-GO"]
[385,"FONTE","CÓDIGO","DESCRIÇÃO","UNIDADE","COEFIC.","CUSTO UNITÁRIO",null,"CUSTO  TOTAL (A) + (B) + (C) + (D) + (E)"]
[null,null,null,null,null,null,"DESONERADO","NÃO DESONER.","DESONERADO","NÃO DESONER."]
[null,"COMPOSIÇÃO","COMP 385_SEE","DEMOLIÇÃO POSTE DE CONCRETO/METALICA ENTRE 10 E 15 METROS C/ REAPROVEITAMENTO C/ TRANSPORTE ATE CAÇAMBA E CARGA","UN ",null,null,null,138.75,140.13999999999999]
[null,"AGETOP_I",8,"AJUDANTE","h     ",1,8.75,10.14,8.75,10.14]
[null,"MÃO DE OBRA (B) - TOTAL",null,null,null,null,null,null,8.75,10.14]
[null,"AGETOP",72080,"POSTE/TRAFO - CAMINHÃO MUNCK 12 TON. (MÍNIMO 4H/DIA)","H     ",1,130,130,130,130]
[null,"MATERIAL (C) - TOTAL",null,null,null,null,null,null,130,130]
[]
[554,"FONTE","CÓDIGO","DESCRIÇÃO","UNID ","COEFIC.","CUSTO UNITÁRIO",null,"CUSTO  TOTAL (A) + (B) + (C) + (D) + (E)"]
[null,null,null,null,null,null,"DESONERADO","NÃO DESONER.","DESONERADO","NÃO DESONER."]
[null,"COMPOSIÇÃO","COMP 554_SEE","CAIXA DE DECANTAÇÃO","UN ","-","-","-",698.68999999999994,743.82]
[null,"AGETOP",81840,"TAMPA  PARA CAIXA PASSAGEM FERRO FUNDIDO T-33 - TRÁFEGO LEVE","Un    ",1,114.58,117,114.58,117]
[null,"AGETOP",81938,"JOELHO 90 GRAUS DIAMETRO 100 MM","Un    ",1,15.63,17.239999999999998,15.63,17.239999999999998]
[null,"AGETOP",82235,"TE SANITARIO DIAMETRO 100 X 100 MM","Un    ",1,25.46,27.1,25.46,27.1]
[null,"AGETOP",82304,"TUBO SOLDAVEL P/ESGOTO DIAM. 100 MM","m     ",3,21.02,22.89,63.06,68.67]
[null,"AGETOP",100102,"ALVENARIA DE TIJOLO COMUM 1/2 VEZ - ARG. (1CI : 2CH : 8ARML)","m2    ",8,57.8,61.9,462.4,495.2]
[null,"AGETOP",220050,"LASTRO DE CONCRETO REGULARIZADO SEM IMPERMEAB. 1:3:6 ESP= 5CM (BASE)","m2    ",1,17.559999999999999,18.61,17.559999999999999,18.61]
[null,"MÃO DE OBRA (B) - TOTAL",null,null,null,null,null,null,698.68999999999994,743.82]
[null,"MATERIAL (C) - TOTAL",null,null,null,null,null,null,0,0]
[]
[382,"FONTE","CÓDIGO","DESCRIÇÃO","UNIDADE","COEFIC.","CUSTO UNITÁRIO",null,"CUSTO  TOTAL (A) + (B) + (C) + (D) + (E)"]
[null,null,null,null,null,null,"DESONERADO","NÃO DESONER.","DESONERADO","NÃO DESONER."]
[null,"COMPOSIÇÃO","COMP 382_SEE","TE DE REDUCAO DE FERRO GALVANIZADO, COM ROSCA BSP, DE 3/4\" X 1/2\"","UN ",null,null,null,14.08,14.91]
[null,"AGETOP_I",8,"AJUDANTE","h     ",0.6,8.75,10.14,5.25,6.08]
[null,"AGETOP_I",11,"MATERIAL ELÉTRICO",0,0.61050000000000004,0,0,0,0]
[null,"MÃO DE OBRA (B) - TOTAL",null,null,null,null,null,null,5.25,6.08]
[null,"SINAPI_I",3146,"FITA VEDA ROSCA EM ROLOS DE 18 MM X 10 M (L X C)","UN    ",0.12075471698113208,3.9,3.9,0.47,0.47]
[null,"SINAPI_I",6302,"TE DE REDUCAO DE FERRO GALVANIZADO, COM ROSCA BSP, DE 3/4\" X 1/2\"","UN    ",1,8.36,8.36,8.36,8.36]
[null,"MATERIAL (C) - TOTAL",null,null,null,null,null,null,8.83,8.83]
[]
[383,"FONTE","CÓDIGO","DESCRIÇÃO","UNIDADE","COEFIC.","CUSTO UNITÁRIO",null,"CUSTO  TOTAL (A) + (B) + (C) + (D) + (E)"]
[null,null,null,null,null,null,"DESONERADO","NÃO DESONER.","DESONERADO","NÃO DESONER."]
[null,"COMPOSIÇÃO","COMP 383_SEE","BUCHA DE REDUCAO DE FERRO GALVANIZADO, COM ROSCA BSP, DE 1/2\" X 1/4\"","UN ",null,null,null,4.4800000000000004,4.7]
[null,"AGETOP_I",8,"AJUDANTE","h     ",0.16,8.75,10.14,1.4,1.62]
[null,"AGETOP_I",11,"MATERIAL ELÉTRICO",0,0.16,0,0,0,0]
[null,"MÃO DE OBRA (B) - TOTAL",null,null,null,null,null,null,1.4,1.62]
[null,"AGETOP_I","H689","","",1.2,0,0,0,0]
[null,"SINAPI_I",770,"BUCHA DE REDUCAO DE FERRO GALVANIZADO, COM ROSCA BSP, DE 1/2\" X 1/4\"","UN    ",1,3.08,3.08,3.08,3.08]
[null,"MATERIAL (C) - TOTAL",null,null,null,null,null,null,3.08,3.08]
[]
[212,"FONTE","CÓDIGO","DESCRIÇÃO","UNIDADE","COEFIC.","CUSTO UNITÁRIO",null,"CUSTO  TOTAL (A) + (B) + (C) + (D) + (E)"]
[null,null,null,null,null,null,"DESONERADO","NÃO DESONER.","DESONERADO","NÃO DESONER."]
[null,"COMPOSIÇÃO","COMP 212_SEE","NIPLE DE REDUÇÃO 1/2\" X 1/4\" BSP","UN ",null,null,null,7.4499999999999993,7.67]
[null,"AGETOP_I",8,"AJUDANTE","h     ",0.16,8.75,10.14,1.4,1.62]
[null,"AGETOP_I",11,"MATERIAL ELÉTRICO",0,0.16,0,0,0,0]
[null,"MÃO DE OBRA (B) - TOTAL",null,null,null,null,null,null,1.4,1.62]
[null,"COTAÇÃO","COT 103_SEE","NIPLE DE REDUÇÃO 1/2\" X 1/4\" BSP","UN",1,6.0533333333333337,6.0533333333333337,6.05,6.05]
[null,"MATERIAL (C) - TOTAL",null,null,null,null,null,null,6.05,6.05]
[]
[213,"FONTE","CÓDIGO","DESCRIÇÃO","UNIDADE","COEFIC.","CUSTO UNITÁRIO",null,"CUSTO  TOTAL (A) + (B) + (C) + (D) + (E)"]
[null,null,null,null,null,null,"DESONERADO","NÃO DESONER.","DESONERADO","NÃO DESONER."]
[null,"COMPOSIÇÃO","COMP 213_SEE","NIPLE DE REDUÇÃO 3/4\" X 1/2\" BSP","UN ",null,null,null,11.110000000000001,11.330000000000002]
[null,"AGETOP_I",8,"AJUDANTE","h     ",0.16,8.75,10.14,1.4,1.62]
[null,"AGETOP_I",11,"MATERIAL ELÉTRICO",0,0.16,0,0,0,0]
[null,"MÃO DE OBRA (B) - TOTAL",null,null,null,null,null,null,1.4,1.62]
[null,"COTAÇÃO","COT 104_SEE","NIPLE DE REDUÇÃO 3/4\" X 1/2\" BSP","UN",1,9.7099999999999991,9.7099999999999991,9.7100000000000009,9.7100000000000009]
[null,"MATERIAL (C) - TOTAL",null,null,null,null,null,null,9.7100000000000009,9.7100000000000009]
[]
[237,"FONTE","CÓDIGO","DESCRIÇÃO","UNIDADE","COEFIC.","CUSTO UNITÁRIO",null,"CUSTO  TOTAL (A) + (B) + (C) + (D) + (E)"]
[null,null,null,null,null,null,"DESONERADO","NÃO DESONER.","DESONERADO","NÃO DESONER."]
[null,"COMPOSIÇÃO","COMP 237_SEE","FITA ANTICORROSIVA","M",null,null,null,9.35,9.629999999999999]
[null,"AGETOP_I",8,"AJUDANTE","h     ",0.2,8.75,10.14,1.75,2.0299999999999998]
[null,"AGETOP_I",12,"MATERIAL HIDRO-SANITÁRIO",0,0.2,0,0,0,0]
[null,"MÃO DE OBRA (B) - TOTAL",null,null,null,null,null,null,1.75,2.0299999999999998]
[null,"SINAPI_I",39634,"FITA ADESIVA ANTICORROSIVA DE PVC FLEXIVEL, COR PRETA, PARA PROTECAO TUBULACAO, 50 MM X 30 M (L X C), E= *0,25* MM","M     ",1,7.6,7.6,7.6,7.6]
[null,"MATERIAL (C) - TOTAL",null,null,null,null,null,null,7.6,7.6]
[]
[542,"FONTE","CÓDIGO","DESCRIÇÃO","UNIDADE","COEFIC.","CUSTO UNITÁRIO",null,"CUSTO  TOTAL (A) + (B) + (C) + (D) + (E)"]
[null,null,null,null,null,null,"DESONERADO","NÃO DESONER.","DESONERADO","NÃO DESONER."]
[null,"COMPOSIÇÃO","COMP 542_SEE","VÁLVULA UGV 3/4\" (S) LATÃO","UN ",null,null,null,19.62,20.22]
[null,"AGETOP_I",8,"AJUDANTE","h     ",0.432,8.75,10.14,3.78,4.38]
[null,"AGETOP_I",11,"MATERIAL ELÉTRICO",0,0.432,0,0,0,0]
[null,"MÃO DE OBRA (B) - TOTAL",null,null,null,null,null,null,3.78,4.38]
[null,"COTAÇÃO","COT 281_SEE","VÁLVULA UGV 3/4\" (S) LATÃO","UN ",1,15.836666666666666,15.836666666666666,15.84,15.84]
[null,"MATERIAL (C) - TOTAL",null,null,null,null,null,null,15.84,15.84]
[]
[543,"FONTE","CÓDIGO","DESCRIÇÃO","UNIDADE","COEFIC.","CUSTO UNITÁRIO",null,"CUSTO  TOTAL (A) + (B) + (C) + (D) + (E)"]
[null,null,null,null,null,null,"DESONERADO","NÃO DESONER.","DESONERADO","NÃO DESONER."]
[null,"COMPOSIÇÃO","COMP 543_SEE","VÁLVULA UGV 1/2\" (S) LATÃO","UN ",null,null,null,18.95,19.55]
[null,"AGETOP_I",8,"AJUDANTE","h     ",0.432,8.75,10.14,3.78,4.38]
[null,"AGETOP_I",11,"MATERIAL ELÉTRICO",0,0.432,0,0,0,0]
[null,"MÃO DE OBRA (B) - TOTAL",null,null,null,null,null,null,3.78,4.38]
[null,"COTAÇÃO","COT 282_SEE","VÁLVULA UGV 1/2\" (S) LATÃO","UN ",1,15.166666666666666,15.166666666666666,15.17,15.17]
[null,"MATERIAL (C) - TOTAL",null,null,null,null,null,null,15.17,15.17]
[]
[211,"FONTE","CÓDIGO","DESCRIÇÃO","UNIDADE","COEFIC.","CUSTO UNITÁRIO",null,"CUSTO  TOTAL (A) + (B) + (C) + (D) + (E)"]
[null,null,null,null,null,null,"DESONERADO","NÃO DESONER.","DESONERADO","NÃO DESONER."]
[null,"COMPOSIÇÃO","COMP 211_SEE","REGULADOR DE 2º ESTÁGIO 5KG/H","UN ",null,null,null,69.89,71.489999999999995]
[null,"AGETOP_I",8,"AJUDANTE","h     ",1.1499999999999999,8.75,10.14,10.06,11.66]
[null,"AGETOP_I",11,"MATERIAL ELÉTRICO",0,1.1499999999999999,0,0,0,0]
[null,"MÃO DE OBRA (B) - TOTAL",null,null,null,null,null,null,10.06,11.66]
[null,"COTAÇÃO","COT 102_SEE","REGULADOR DE 2º ESTÁGIO 5KG/H","UN",1,59.833333333333336,59.833333333333336,59.83,59.83]
[null,"AGETOP_I","H689","","",2.82,0,0,0,0]
[null,"MATERIAL (C) - TOTAL",null,null,null,null,null,null,59.83,59.83]
[]
[210,"FONTE","CÓDIGO","DESCRIÇÃO","UNIDADE","COEFIC.","CUSTO UNITÁRIO",null,"CUSTO  TOTAL (A) + (B) + (C) + (D) + (E)"]
[null,null,null,null,null,null,"DESONERADO","NÃO DESONER.","DESONERADO","NÃO DESONER."]
[null,"COMPOSIÇÃO","COMP 210_SEE","REGULADOR DE 1º ESTÁGIO 60KG/H MODELO AP-40  COM MANÔMETRO","UN ",null,null,null,215.64000000000001,217.24]
[null,"AGETOP_I",8,"AJUDANTE","h     ",1.1499999999999999,8.75,10.14,10.06,11.66]
[null,"AGETOP_I",11,"MATERIAL ELÉTRICO",0,1.1499999999999999,0,0,0,0]
[null,"MÃO DE OBRA (B) - TOTAL",null,null,null,null,null,null,10.06,11.66]
[null,"COTAÇÃO","COT 101_SEE","REGULADOR DE 1º ESTÁGIO 60KG/H MODELO AP-40  COM MANÔMETRO","UN",1,205.57666666666668,205.57666666666668,205.58,205.58]
[null,"AGETOP_I","H689","","",2.82,0,0,0,0]
[null,"MATERIAL (C) - TOTAL",null,null,null,null,null,null,205.58,205.58]
[]
[235,"FONTE","CÓDIGO","DESCRIÇÃO","UNIDADE","COEFIC.","CUSTO UNITÁRIO",null,"CUSTO  TOTAL (A) + (B) + (C) + (D) + (E)"]
[null,null,null,null,null,null,"DESONERADO","NÃO DESONER.","DESONERADO","NÃO DESONER."]
[null,"COMPOSIÇÃO","COMP 235_SEE","PLACA DE SINALIZAÇÃO EM PVC COD 01 - (300X300) PROIBIDO FUMAR","UN ",null,null,null,24.159999999999997,24.279999999999998]
[null,"AGETOP_I",5,"SERVENTE","h     ",0.09,8.75,10.14,0.79,0.91]
[null,"MÃO DE OBRA (B) - TOTAL",null,null,null,null,null,null,0.79,0.91]
[null,"AGETOP_I",3070,"BUCHA DE NYLON S-6","un",2,0.04,0.04,0.08,0.08]
[null,"AGETOP_I",3393,"PARAFUSO P/BUCHA S-6","un",2,0.08,0.08,0.16,0.16]
[null,"SINAPI_I",37556,"PLACA DE SINALIZACAO DE SEGURANCA CONTRA INCENDIO, FOTOLUMINESCENTE, QUADRADA, *20 X 20* CM, EM PVC *2* MM ANTI-CHAMAS (SIMBOLOS, CORES E PICTOGRAMAS CONFORME NBR 13434)","UN    ",1,23.13,23.13,23.13,23.13]
[null,"MATERIAL (C) - TOTAL",null,null,null,null,null,null,23.369999999999997,23.369999999999997]
[]
[236,"FONTE","CÓDIGO","DESCRIÇÃO","UNIDADE","COEFIC.","CUSTO UNITÁRIO",null,"CUSTO  TOTAL (A) + (B) + (C) + (D) + (E)"]
[null,null,null,null,null,null,"DESONERADO","NÃO DESONER.","DESONERADO","NÃO DESONER."]
[null,"COMPOSIÇÃO","COMP 236_SEE","PLACA DE SINALIZAÇÃO EM PVC COD 06 - (300X300) PERIGO INFLAMÁVEL","UN ",null,null,null,24.159999999999997,24.279999999999998]
[null,"AGETOP_I",5,"SERVENTE","h     ",0.09,8.75,10.14,0.79,0.91]
[null,"MÃO DE OBRA (B) - TOTAL",null,null,null,null,null,null,0.79,0.91]
[null,"AGETOP_I",3070,"BUCHA DE NYLON S-6","un",2,0.04,0.04,0.08,0.08]
[null,"AGETOP_I",3393,"PARAFUSO P/BUCHA S-6","un",2,0.08,0.08,0.16,0.16]
[null,"SINAPI_I",37556,"PLACA DE SINALIZACAO DE SEGURANCA CONTRA INCENDIO, FOTOLUMINESCENTE, QUADRADA, *20 X 20* CM, EM PVC *2* MM ANTI-CHAMAS (SIMBOLOS, CORES E PICTOGRAMAS CONFORME NBR 13434)","UN    ",1,23.13,23.13,23.13,23.13]
[null,"MATERIAL (C) - TOTAL",null,null,null,null,null,null,23.369999999999997,23.369999999999997]
[]
[40,"FONTE","CÓDIGO","DESCRIÇÃO","UNIDADE","COEFIC.","CUSTO UNITÁRIO",null,"CUSTO  TOTAL (A) + (B) + (C) + (D) + (E)"]
[null,null,null,null,null,null,"DESONERADO","NÃO DESONER.","DESONERADO","NÃO DESONER."]
[null,"COMPOSIÇÃO","COMP 040_SEE","CONJUNTO MOTOR-BOMBA ELÉTRICA TRIFÁSICO 380/220 V PARA VZ= 24,33 M³/H, HM= 46,24 M POTÊNCIA= 7,5 CV","UN ",null,null,null,3862.67,3873.79]
[null,"AGETOP_I",8,"AJUDANTE","h     ",8,8.75,10.14,70,81.12]
[null,"AGETOP_I",11,"MATERIAL ELÉTRICO",0,8,0,0,0,0]
[null,"MÃO DE OBRA (B) - TOTAL",null,null,null,null,null,null,70,81.12]
[null,"COTAÇÃO","COT 008_SEE","CONJUNTO MOTOR-BOMBA ELÉTRICA TRIFÁSICO 380/220 V PARA VZ= 24,33 M³/H, HM= 46,24 M POTÊNCIA= 7,5 CV","UN ",1,3792.6666666666665,3792.6666666666665,3792.67,3792.67]
[null,"MATERIAL (C) - TOTAL",null,null,null,null,null,null,3792.67,3792.67]
[]
[17,"FONTE","CÓDIGO","DESCRIÇÃO","UNIDADE","COEFIC.","CUSTO UNITÁRIO",null,"CUSTO  TOTAL (A) + (B) + (C) + (D) + (E)"]
[null,null,null,null,null,null,"DESONERADO","NÃO DESONER.","DESONERADO","NÃO DESONER."]
[null,"COMPOSIÇÃO","COMP 017_SEE","REDUCAO GIRATÓRIA TIPO STORZ LATAO P/ INST. PREDIAL COMBATE A INCENDIO ENGATE RAPIDO 2.1/2\" X 1.1/2\"","UN ",null,"-","-",97.09,97.31]
[null,"AGETOP_I",8,"AJUDANTE","h     ",0.16,8.75,10.14,1.4,1.62]
[null,"AGETOP_I",11,"MATERIAL ELÉTRICO",0,0.16,0,0,0,0]
[null,"MÃO DE OBRA (B) - TOTAL",null,null,null,null,null,null,1.4,1.62]
[null,"SINAPI_I",20972,"REDUCAO FIXA TIPO STORZ, ENGATE RAPIDO 2.1/2\" X 1.1/2\", EM LATAO, PARA INSTALACAO PREDIAL COMBATE A INCENDIO PREDIAL","UN    ",1,95.69,95.69,95.69,95.69]
[null,"MATERIAL (C) - TOTAL",null,null,null,null,null,null,95.69,95.69]
[]
[18,"FONTE","CÓDIGO","DESCRIÇÃO","UNIDADE","COEFIC.","CUSTO UNITÁRIO",null,"CUSTO  TOTAL (A) + (B) + (C) + (D) + (E)"]
[null,null,null,null,null,null,"DESONERADO","NÃO DESONER.","DESONERADO","NÃO DESONER."]
[null,"COMPOSIÇÃO","COMP 018_SEE","CHAVE DUPLA P/ CONEXÕES TIPO STORZ EM LATÃO ENGATE RÁPIDO 1 1/2\" X 2 1/2\"","UN ",null,"-","-",12.75,12.75]
[null,"AGETOP_I",11,"MATERIAL ELÉTRICO",0,0.15,0,0,0,0]
[null,"MÃO DE OBRA (B) - TOTAL",null,null,null,null,null,null,0,0]
[null,"SINAPI_I",20971,"CHAVE DUPLA PARA CONEXOES TIPO STORZ, ENGATE RAPIDO 1 1/2\" X 2 1/2\", EM LATAO, PARA INSTALACAO PREDIAL COMBATE A INCENDIO","UN    ",1,12.75,12.75,12.75,12.75]
[null,"MATERIAL (C) - TOTAL",null,null,null,null,null,null,12.75,12.75]
[]
[87,"FONTE","CÓDIGO","DESCRIÇÃO","UNIDADE","COEFIC.","CUSTO UNITÁRIO",null,"CUSTO  TOTAL (A) + (B) + (C) + (D) + (E)"]
[null,null,null,null,null,null,"DESONERADO","NÃO DESONER.","DESONERADO","NÃO DESONER."]
[null,"COMPOSIÇÃO","COMP 087_SEE","REGISTRO DE GAVETA COM HASTE ASCENDENTE DE BRONZE 2 1/2\"","UN ",null,null,null,241.73,243.32999999999998]
[null,"AGETOP_I",8,"AJUDANTE","h     ",1.1499999999999999,8.75,10.14,10.06,11.66]
[null,"AGETOP_I",11,"MATERIAL ELÉTRICO",0,1.1499999999999999,0,0,0,0]
[null,"MÃO DE OBRA (B) - TOTAL",null,null,null,null,null,null,10.06,11.66]
[null,"AGETOP_I","H689","","",2.82,0,0,0,0]
[null,"COTAÇÃO","COT 017_SEE","REGISTRO DE GAVETA COM HASTE ASCENDENTE DE BRONZE 2 1/2\"","UN ",1,231.66666666666666,231.66666666666666,231.67,231.67]
[null,"MATERIAL (C) - TOTAL",null,null,null,null,null,null,231.67,231.67]
[]
[30,"FONTE","CÓDIGO","DESCRIÇÃO","UNIDADE","COEFIC.","CUSTO UNITÁRIO",null,"CUSTO  TOTAL (A) + (B) + (C) + (D) + (E)"]
[null,null,null,null,null,null,"DESONERADO","NÃO DESONER.","DESONERADO","NÃO DESONER."]
[null,"COMPOSIÇÃO","COMP 030_SEE","COTOVELO DE FERRO GALV. 90° X 2 1/2\"","UN ",null,null,null,56.78,58.059999999999995]
[null,"AGETOP_I",8,"AJUDANTE","h     ",0.92,8.75,10.14,8.0500000000000007,9.33]
[null,"AGETOP_I",11,"MATERIAL ELÉTRICO",0,0.92,0,0,0,0]
[null,"MÃO DE OBRA (B) - TOTAL",null,null,null,null,null,null,8.0500000000000007,9.33]
[null,"SINAPI_I",3470,"COTOVELO 90 GRAUS DE FERRO GALVANIZADO, COM ROSCA BSP, DE 2 1/2\"","UN    ",1,48.73,48.73,48.73,48.73]
[null,"AGETOP_I","H689","","",2,0,0,0,0]
[null,"MATERIAL (C) - TOTAL",null,null,null,null,null,null,48.73,48.73]
[]
[77,"FONTE","CÓDIGO","DESCRIÇÃO","UNIDADE","COEFIC.","CUSTO UNITÁRIO",null,"CUSTO  TOTAL (A) + (B) + (C) + (D) + (E)"]
[null,null,null,null,null,null,"DESONERADO","NÃO DESONER.","DESONERADO","NÃO DESONER."]
[null,"COMPOSIÇÃO","COMP 077_SEE","UNIAO FERRO GALV C/ASSENTO CONICO BRONZE 2 1/2\"","UN ",null,null,null,142.49,143.05000000000001]
[null,"AGETOP_I",8,"AJUDANTE","h     ",0.4,8.75,10.14,3.5,4.0599999999999996]
[null,"AGETOP_I",11,"MATERIAL ELÉTRICO",0,0.4,0,0,0,0]
[null,"MÃO DE OBRA (B) - TOTAL",null,null,null,null,null,null,3.5,4.0599999999999996]
[null,"AGETOP_I","H689","","",2.4,0,0,0,0]
[null,"SINAPI_I",12427,"UNIAO COM ASSENTO CONICO DE BRONZE, DIAMETRO 2 1/2\"","UN    ",1,138.99,138.99,138.99,138.99]
[null,"MATERIAL (C) - TOTAL",null,null,null,null,null,null,138.99,138.99]
[]
[347,"FONTE","CÓDIGO","DESCRIÇÃO","UNIDADE","COEFIC.","CUSTO UNITÁRIO",null,"CUSTO  TOTAL (A) + (B) + (C) + (D) + (E)"]
[null,null,null,null,null,null,"DESONERADO","NÃO DESONER.","DESONERADO","NÃO DESONER."]
[null,"COMPOSIÇÃO","COMP 347_SEE","ADAPTADOR PVC SOLDAVEL, COM FLANGES LIVRES, 75 MM X 2 1/2\", PARA CAIXA D' AGUA","UN ",null,null,null,117.83,118.02]
[null,"AGETOP_I",11,"MATERIAL ELÉTRICO",0,0.14000000000000001,0,0,0,0]
[null,"AGETOP_I",8,"AJUDANTE","h     ",0.14000000000000001,8.75,10.14,1.23,1.42]
[null,"MÃO DE OBRA (B) - TOTAL",null,null,null,null,null,null,1.23,1.42]
[null,"SINAPI_I",83,"ADAPTADOR PVC SOLDAVEL, COM FLANGES LIVRES, 75 MM X 2  1/2\", PARA CAIXA D' AGUA","UN    ",1,116.6,116.6,116.6,116.6]
[null,"AGETOP_I","H689","","",1.88,0,0,0,0]
[null,"MATERIAL (C) - TOTAL",null,null,null,null,null,null,116.6,116.6]
[]
[22,"FONTE","CÓDIGO","DESCRIÇÃO","UNIDADE","COEFIC.","CUSTO UNITÁRIO",null,"CUSTO  TOTAL (A) + (B) + (C) + (D) + (E)"]
[null,null,null,null,null,null,"DESONERADO","NÃO DESONER.","DESONERADO","NÃO DESONER."]
[null,"COMPOSIÇÃO","COMP 022_SEE","TAMPÃO FOFO 40X50CM C/INSCRIÇÃO ","UN ",null,"-","-",195.55,195.55]
[null,"AGETOP_I",11,"MATERIAL ELÉTRICO",0,0.15,0,0,0,0]
[null,"MÃO DE OBRA (B) - TOTAL",null,null,null,null,null,null,0,0]
[null,"SINAPI_I",11293,"TAMPAO FOFO SIMPLES COM BASE, CLASSE A15 CARGA MAX 1,5 T, 400 X 500 MM, COM INSCRICAO INCENDIO","UN    ",1,195.55,195.55,195.55,195.55]
[null,"MATERIAL (C) - TOTAL",null,null,null,null,null,null,195.55,195.55]
[]
[546,"FONTE","CÓDIGO","DESCRIÇÃO","UNID ","COEFIC.","CUSTO UNITÁRIO",null,"CUSTO  TOTAL (A) + (B) + (C) + (D) + (E)"]
[null,null,null,null,null,null,"DESONERADO","NÃO DESONER.","DESONERADO","NÃO DESONER."]
[null,"COMPOSIÇÃO","COMP 546_SEE","BUJÃO DE REBORDO 2.1/2\"","UN ","-","-","-",15.61,15.71]
[null,"AGETOP_I",8,"AJUDANTE","h     ",7.0000000000000007E-2,8.75,10.14,0.61,0.71]
[null,"AGETOP_I",11,"MATERIAL ELÉTRICO",0,7.0000000000000007E-2,0,0,0,0]
[null,"MÃO DE OBRA (B) - TOTAL",null,null,null,null,null,null,0.61,0.71]
[null,"COTAÇÃO","COT 286_SEE","BUJÃO DE REBORDO 2.1/2\"","UN ",1,15,15,15,15]
[null,"MATERIAL (C) - TOTAL",null,null,null,null,null,null,15,15]
[]
[186,"FONTE","CÓDIGO","DESCRIÇÃO","UNIDADE","COEFIC.","CUSTO UNITÁRIO",null,"CUSTO  TOTAL (A) + (B) + (C) + (D) + (E)"]
[null,null,null,null,null,null,"DESONERADO","NÃO DESONER.","DESONERADO","NÃO DESONER."]
[null,"COMPOSIÇÃO","COMP 186_SEE","BOTOEIRA BOMBA DE INCÊNDIO C/ MARTELO CONVENCIONAL/ ANALÓGICA","UN ",null,null,null,72.25,73.64]
[null,"AGETOP_I",8,"AJUDANTE","h     ",1,8.75,10.14,8.75,10.14]
[null,"AGETOP_I",12,"MATERIAL HIDRO-SANITÁRIO",0,1,0,0,0,0]
[null,"MÃO DE OBRA (B) - TOTAL",null,null,null,null,null,null,8.75,10.14]
[null,"COTAÇÃO","COT 088_SEE","BOTOEIRA BOMBA DE INCÊNDIO C/ MARTELO CONVENCIONAL/ ANALÓGICA","UN",1,63.5,63.5,63.5,63.5]
[null,"MATERIAL (C) - TOTAL",null,null,null,null,null,null,63.5,63.5]
[]
[188,"FONTE","CÓDIGO","DESCRIÇÃO","UNIDADE","COEFIC.","CUSTO UNITÁRIO",null,"CUSTO  TOTAL (A) + (B) + (C) + (D) + (E)"]
[null,null,null,null,null,null,"DESONERADO","NÃO DESONER.","DESONERADO","NÃO DESONER."]
[null,"COMPOSIÇÃO","COMP 188_SEE","ACIONADOR MANUAL DE ALARME","UN ",null,null,null,90.33,91.44]
[null,"AGETOP_I",8,"AJUDANTE","h     ",0.8,8.75,10.14,7,8.11]
[null,"AGETOP_I",12,"MATERIAL HIDRO-SANITÁRIO",0,0.8,0,0,0,0]
[null,"MÃO DE OBRA (B) - TOTAL",null,null,null,null,null,null,7,8.11]
[null,"COTAÇÃO","COT 090_SEE","ACIONADOR MANUAL DE ALARME","UN",1,83.333333333333329,83.333333333333329,83.33,83.33]
[null,"MATERIAL (C) - TOTAL",null,null,null,null,null,null,83.33,83.33]
[]
[190,"FONTE","CÓDIGO","DESCRIÇÃO","UNIDADE","COEFIC.","CUSTO UNITÁRIO",null,"CUSTO  TOTAL (A) + (B) + (C) + (D) + (E)"]
[null,null,null,null,null,null,"DESONERADO","NÃO DESONER.","DESONERADO","NÃO DESONER."]
[null,"COMPOSIÇÃO","COMP 190_SEE","CENTRAL DE DETECÇÃO E ALARME DE 40 SETORES COM BATERIA","UN ",null,null,null,1033.33,1044.45]
[null,"AGETOP_I",8,"AJUDANTE","h     ",8,8.75,10.14,70,81.12]
[null,"AGETOP_I",12,"MATERIAL HIDRO-SANITÁRIO",0,8,0,0,0,0]
[null,"MÃO DE OBRA (B) - TOTAL",null,null,null,null,null,null,70,81.12]
[null,"COTAÇÃO","COT 092_SEE","CENTRAL DE DETECÇÃO E ALARME DE 40 SETORES COM BATERIA (PREÇO MÉDIO)","UN",1,963.33333333333337,963.33333333333337,963.33,963.33]
[null,"MATERIAL (C) - TOTAL",null,null,null,null,null,null,963.33,963.33]
[]
[24,"FONTE","CÓDIGO","DESCRIÇÃO","UNIDADE","COEFIC.","CUSTO UNITÁRIO",null,"CUSTO  TOTAL (A) + (B) + (C) + (D) + (E)"]
[null,null,null,null,null,null,"DESONERADO","NÃO DESONER.","DESONERADO","NÃO DESONER."]
[null,"COMPOSIÇÃO","COMP 024_SEE","SINALIZADOR FOTOLUMINESCENTE PARA EXTINTOR","UN ",null,"-","-",24.159999999999997,24.279999999999998]
[null,"AGETOP_I",5,"SERVENTE","h     ",0.09,8.75,10.14,0.79,0.91]
[null,"MÃO DE OBRA (B) - TOTAL",null,null,null,null,null,null,0.79,0.91]
[null,"AGETOP_I",3070,"BUCHA DE NYLON S-6","un",2,0.04,0.04,0.08,0.08]
[null,"AGETOP_I",3393,"PARAFUSO P/BUCHA S-6","un",2,0.08,0.08,0.16,0.16]
[null,"SINAPI_I",37556,"PLACA DE SINALIZACAO DE SEGURANCA CONTRA INCENDIO, FOTOLUMINESCENTE, QUADRADA, *20 X 20* CM, EM PVC *2* MM ANTI-CHAMAS (SIMBOLOS, CORES E PICTOGRAMAS CONFORME NBR 13434)","UN    ",1,23.13,23.13,23.13,23.13]
[null,"MATERIAL (C) - TOTAL",null,null,null,null,null,null,23.369999999999997,23.369999999999997]
[]
[25,"FONTE","CÓDIGO","DESCRIÇÃO","UNIDADE","COEFIC.","CUSTO UNITÁRIO",null,"CUSTO  TOTAL (A) + (B) + (C) + (D) + (E)"]
[null,null,null,null,null,null,"DESONERADO","NÃO DESONER.","DESONERADO","NÃO DESONER."]
[null,"COMPOSIÇÃO","COMP 025_SEE","SINALIZADOR FOTOLUMINESCENTE DE EMERGÊNCIA","UN ",null,"-","-",24.159999999999997,24.279999999999998]
[null,"AGETOP_I",5,"SERVENTE","h     ",0.09,8.75,10.14,0.79,0.91]
[null,"MÃO DE OBRA (B) - TOTAL",null,null,null,null,null,null,0.79,0.91]
[null,"AGETOP_I",3070,"BUCHA DE NYLON S-6","un",2,0.04,0.04,0.08,0.08]
[null,"AGETOP_I",3393,"PARAFUSO P/BUCHA S-6","un",2,0.08,0.08,0.16,0.16]
[null,"SINAPI_I",37556,"PLACA DE SINALIZACAO DE SEGURANCA CONTRA INCENDIO, FOTOLUMINESCENTE, QUADRADA, *20 X 20* CM, EM PVC *2* MM ANTI-CHAMAS (SIMBOLOS, CORES E PICTOGRAMAS CONFORME NBR 13434)","UN    ",1,23.13,23.13,23.13,23.13]
[null,"MATERIAL (C) - TOTAL",null,null,null,null,null,null,23.369999999999997,23.369999999999997]
[]
[277,"FONTE","CÓDIGO","DESCRIÇÃO","UNIDADE","COEFIC.","CUSTO UNITÁRIO",null,"CUSTO  TOTAL (A) + (B) + (C) + (D) + (E)"]
[null,null,null,null,null,null,"DESONERADO","NÃO DESONER.","DESONERADO","NÃO DESONER."]
[null,"COMPOSIÇÃO","COMP 277_SEE","MARCAÇÃO NO PISO - 1X1 M PARA EXTINTOR","M2",null,null,null,29.419999999999998,29.49]
[null,"AGETOP_I",5,"SERVENTE","h     ",3.3300000000000003E-2,8.75,10.14,0.28999999999999998,0.34]
[null,"MÃO DE OBRA (B) - TOTAL",null,null,null,null,null,null,0.28999999999999998,0.34]
[null,"SINAPI_I",5318,"SOLVENTE DILUENTE A BASE DE AGUARRAS","L     ",0.13,10.86,10.86,1.41,1.41]
[null,"SINAPI",5824,"CAMINHÃO TOCO, PBT 16.000 KG, CARGA ÚTIL MÁX. 10.685 KG, DIST. ENTRE EIXOS 4,8 M, POTÊNCIA 189 CV, INCLUSIVE CARROCERIA FIXA ABERTA DE MADEIRA P/ TRANSPORTE GERAL DE CARGA SECA, DIMEN. APROX. 2,5 X 7,00 X 0,50 M - CHP DIURNO. AF_06/2014","CHP",3.3E-3,123.81,127,0.41,0.42]
[null,"SINAPI_I",7343,"TINTA A BASE DE RESINA ACRILICA, PARA SINALIZACAO HORIZONTAL VIARIA (NBR 11862)","L     ",0.6,12.55,12.55,7.53,7.53]
[null,"SINAPI_I",7348,"TINTA ACRILICA PREMIUM PARA PISO","L     ",0.03,13.5,13.5,0.41,0.41]
[null,"SINAPI_I",25972,"MICROESFERAS DE VIDRO PARA SINALIZACAO HORIZONTAL VIARIA, TIPO I-B (PREMIX) - NBR 16184","KG    ",2.14,8.8800000000000008,8.8800000000000008,19,19]
[null,"SINAPI",95133,"MÁQUINA DEMARCADORA DE FAIXA DE TRÁFEGO À FRIO, AUTOPROPELIDA, POTÊNCIA 38 HP - CHP DIURNO. AF_07/2016","CHP",3.3E-3,111.85,115.4,0.37,0.38]
[null,"MATERIAL (C) - TOTAL",null,null,null,null,null,null,29.13,29.15]
[]
[235,"FONTE","CÓDIGO","DESCRIÇÃO","UNIDADE","COEFIC.","CUSTO UNITÁRIO",null,"CUSTO  TOTAL (A) + (B) + (C) + (D) + (E)"]
[null,null,null,null,null,null,"DESONERADO","NÃO DESONER.","DESONERADO","NÃO DESONER."]
[null,"COMPOSIÇÃO","COMP 235_SEE","PLACA DE SINALIZAÇÃO EM PVC COD 01 - (300X300) PROIBIDO FUMAR","UN ",null,null,null,24.159999999999997,24.279999999999998]
[null,"AGETOP_I",5,"SERVENTE","h     ",0.09,8.75,10.14,0.79,0.91]
[null,"MÃO DE OBRA (B) - TOTAL",null,null,null,null,null,null,0.79,0.91]
[null,"AGETOP_I",3070,"BUCHA DE NYLON S-6","un",2,0.04,0.04,0.08,0.08]
[null,"AGETOP_I",3393,"PARAFUSO P/BUCHA S-6","un",2,0.08,0.08,0.16,0.16]
[null,"SINAPI_I",37556,"PLACA DE SINALIZACAO DE SEGURANCA CONTRA INCENDIO, FOTOLUMINESCENTE, QUADRADA, *20 X 20* CM, EM PVC *2* MM ANTI-CHAMAS (SIMBOLOS, CORES E PICTOGRAMAS CONFORME NBR 13434)","UN    ",1,23.13,23.13,23.13,23.13]
[null,"MATERIAL (C) - TOTAL",null,null,null,null,null,null,23.369999999999997,23.369999999999997]
[]
[236,"FONTE","CÓDIGO","DESCRIÇÃO","UNIDADE","COEFIC.","CUSTO UNITÁRIO",null,"CUSTO  TOTAL (A) + (B) + (C) + (D) + (E)"]
[null,null,null,null,null,null,"DESONERADO","NÃO DESONER.","DESONERADO","NÃO DESONER."]
[null,"COMPOSIÇÃO","COMP 236_SEE","PLACA DE SINALIZAÇÃO EM PVC COD 06 - (300X300) PERIGO INFLAMÁVEL","UN ",null,null,null,24.159999999999997,24.279999999999998]
[null,"AGETOP_I",5,"SERVENTE","h     ",0.09,8.75,10.14,0.79,0.91]
[null,"MÃO DE OBRA (B) - TOTAL",null,null,null,null,null,null,0.79,0.91]
[null,"AGETOP_I",3070,"BUCHA DE NYLON S-6","un",2,0.04,0.04,0.08,0.08]
[null,"AGETOP_I",3393,"PARAFUSO P/BUCHA S-6","un",2,0.08,0.08,0.16,0.16]
[null,"SINAPI_I",37556,"PLACA DE SINALIZACAO DE SEGURANCA CONTRA INCENDIO, FOTOLUMINESCENTE, QUADRADA, *20 X 20* CM, EM PVC *2* MM ANTI-CHAMAS (SIMBOLOS, CORES E PICTOGRAMAS CONFORME NBR 13434)","UN    ",1,23.13,23.13,23.13,23.13]
[null,"MATERIAL (C) - TOTAL",null,null,null,null,null,null,23.369999999999997,23.369999999999997]
[]
[412,"FONTE","CÓDIGO","DESCRIÇÃO","UNIDADE","COEFIC.","CUSTO UNITÁRIO",null,"CUSTO  TOTAL (A) + (B) + (C) + (D) + (E)"]
[null,null,null,null,null,null,"DESONERADO","NÃO DESONER.","DESONERADO","NÃO DESONER."]
[null,"COMPOSIÇÃO","COMP 412_SEE","PLACA DE SINALIZAÇÃO EM PVC COD 17 - (316X158) MENSAGEM \"SAÍDA\"","UN ",null,null,null,29.4,29.52]
[null,"AGETOP_I",5,"SERVENTE","h     ",0.09,8.75,10.14,0.79,0.91]
[null,"MÃO DE OBRA (B) - TOTAL",null,null,null,null,null,null,0.79,0.91]
[null,"AGETOP_I",3070,"BUCHA DE NYLON S-6","un",2,0.04,0.04,0.08,0.08]
[null,"AGETOP_I",3393,"PARAFUSO P/BUCHA S-6","un",2,0.08,0.08,0.16,0.16]
[null,"SINAPI_I",37559,"PLACA DE SINALIZACAO DE SEGURANCA CONTRA INCENDIO, FOTOLUMINESCENTE, RETANGULAR, *12 X 40* CM, EM PVC *2* MM ANTI-CHAMAS (SIMBOLOS, CORES E PICTOGRAMAS CONFORME NBR 13434)","UN    ",1,28.37,28.37,28.37,28.37]
[null,"MATERIAL (C) - TOTAL",null,null,null,null,null,null,28.61,28.61]
[]
[83,"FONTE","CÓDIGO","DESCRIÇÃO","UNIDADE","COEFIC.","CUSTO UNITÁRIO",null,"CUSTO  TOTAL (A) + (B) + (C) + (D) + (E)"]
[null,null,null,null,null,null,"DESONERADO","NÃO DESONER.","DESONERADO","NÃO DESONER."]
[null,"COMPOSIÇÃO","COMP 083_SEE","CORRIMÃO PISO - SEDUC","M",null,null,null,143.18,147.41000000000003]
[null,"AGETOP_I",25,"OFICIAL \"B\"","h     ",1,13.95,16.16,13.95,16.16]
[null,"AGETOP_I",8,"AJUDANTE","h     ",1,8.75,10.14,8.75,10.14]
[null,"MÃO DE OBRA (B) - TOTAL",null,null,null,null,null,null,22.7,26.3]
[null,"AGETOP_I",2376,"TUBO INDUSTRIAL 2\" CHAPA 13 ","Kg",8.2197499999999994,5.23,5.23,42.99,42.99]
[null,"AGETOP_I",2504,"TUBO INDUSTRIAL D=25 MM CHAPA 13 ","Kg",1.1000000000000001,5.07,5.07,5.58,5.58]
[null,"AGETOP_I",2417,"MASSA PLASTICA","Kg",0.2041,10.58,10.58,2.16,2.16]
[null,"AGETOP_I",2246,"ELETRODO 2.5 OK","Kg",0.11459999999999999,8.6999999999999993,8.6999999999999993,1,1]
[null,"AGETOP_I",1672,"LIXA PARA FERRO ( NÚMERO 100 )","un",0.125,2.12,2.12,0.27,0.27]
[null,"AGETOP_I",1264,"DISCO DE DESBASTE 7/8\" P/ CONC./FERRO (1/4\" X 7\")","un",2.5000000000000001E-2,7,7,0.18,0.18]
[null,"AGETOP_I",1334,"DISCO DE CORTE DIAM. 5/8\"- 10\"","un",0.1865,5.5,5.5,1.03,1.03]
[null,"AGETOP_I",2902,"FABRICAÇÃO / MONTAGEM","un",1,50.44,50.44,50.44,50.44]
[null,"AGETOP_I",2150,"CHAPA DE FERRO DOBRADA No.13","Kg",0.43519999999999998,5.28,5.28,2.2999999999999998,2.2999999999999998]
[null,"AGETOP_I",2719,"CHAPA PERFILADA 3/16\"","Kg",1.1644000000000001,5.04,5.04,5.87,5.87]
[null,"AGETOP_I",2436,"ACO CA-25 - 6,3 MM (1/4\") - BARRA LISA A-36","Kg",0.48150000000000004,5.13,5.13,2.4700000000000002,2.4700000000000002]
[null,"AGETOP",261602,"PINT.ESMALTE/ESQUAD.FERRO C/FUNDO ANTICOR.","m2    ",0.44,14.07,15.51,6.19,6.82]
[null,"MATERIAL (C) - TOTAL",null,null,null,null,null,null,120.48,121.11000000000001]
[]
[83,"FONTE","CÓDIGO","DESCRIÇÃO","UNIDADE","COEFIC.","CUSTO UNITÁRIO",null,"CUSTO  TOTAL (A) + (B) + (C) + (D) + (E)"]
[null,null,null,null,null,null,"DESONERADO","NÃO DESONER.","DESONERADO","NÃO DESONER."]
[null,"COMPOSIÇÃO","COMP 083_SEE","CORRIMÃO PISO - SEDUC","M",null,null,null,143.18,147.41000000000003]
[null,"AGETOP_I",25,"OFICIAL \"B\"","h     ",1,13.95,16.16,13.95,16.16]
[null,"AGETOP_I",8,"AJUDANTE","h     ",1,8.75,10.14,8.75,10.14]
[null,"MÃO DE OBRA (B) - TOTAL",null,null,null,null,null,null,22.7,26.3]
[null,"AGETOP_I",2376,"TUBO INDUSTRIAL 2\" CHAPA 13 ","Kg",8.2197499999999994,5.23,5.23,42.99,42.99]
[null,"AGETOP_I",2504,"TUBO INDUSTRIAL D=25 MM CHAPA 13 ","Kg",1.1000000000000001,5.07,5.07,5.58,5.58]
[null,"AGETOP_I",2417,"MASSA PLASTICA","Kg",0.2041,10.58,10.58,2.16,2.16]
[null,"AGETOP_I",2246,"ELETRODO 2.5 OK","Kg",0.11459999999999999,8.6999999999999993,8.6999999999999993,1,1]
[null,"AGETOP_I",1672,"LIXA PARA FERRO ( NÚMERO 100 )","un",0.125,2.12,2.12,0.27,0.27]
[null,"AGETOP_I",1264,"DISCO DE DESBASTE 7/8\" P/ CONC./FERRO (1/4\" X 7\")","un",2.5000000000000001E-2,7,7,0.18,0.18]
[null,"AGETOP_I",1334,"DISCO DE CORTE DIAM. 5/8\"- 10\"","un",0.1865,5.5,5.5,1.03,1.03]
[null,"AGETOP_I",2902,"FABRICAÇÃO / MONTAGEM","un",1,50.44,50.44,50.44,50.44]
[null,"AGETOP_I",2150,"CHAPA DE FERRO DOBRADA No.13","Kg",0.43519999999999998,5.28,5.28,2.2999999999999998,2.2999999999999998]
[null,"AGETOP_I",2719,"CHAPA PERFILADA 3/16\"","Kg",1.1644000000000001,5.04,5.04,5.87,5.87]
[null,"AGETOP_I",2436,"ACO CA-25 - 6,3 MM (1/4\") - BARRA LISA A-36","Kg",0.48150000000000004,5.13,5.13,2.4700000000000002,2.4700000000000002]
[null,"AGETOP",261602,"PINT.ESMALTE/ESQUAD.FERRO C/FUNDO ANTICOR.","m2    ",0.44,14.07,15.51,6.19,6.82]
[null,"MATERIAL (C) - TOTAL",null,null,null,null,null,null,120.48,121.11000000000001]
[]
[206,"FONTE","CÓDIGO","DESCRIÇÃO","UNIDADE","COEFIC.","CUSTO UNITÁRIO",null,"CUSTO  TOTAL (A) + (B) + (C) + (D) + (E)"]
[null,null,null,null,null,null,"DESONERADO","NÃO DESONER.","DESONERADO","NÃO DESONER."]
[null,"COMPOSIÇÃO","COMP 206_SEE","BANCO ARTICULADO PARA BANHO, EM ACO INOX POLIDO, 70* CM X 45* CM","UN ",null,null,null,703.22,704.61]
[null,"AGETOP_I",8,"AJUDANTE","h     ",1,8.75,10.14,8.75,10.14]
[null,"AGETOP_I",11,"MATERIAL ELÉTRICO",0,1,0,0,0,0]
[null,"MÃO DE OBRA (B) - TOTAL",null,null,null,null,null,null,8.75,10.14]
[null,"SINAPI_I",36215,"BANCO ARTICULADO PARA BANHO, EM ACO INOX POLIDO, 70* CM X 45* CM","UN    ",1,692.87,692.87,692.87,692.87]
[null,"AGETOP_I",2221,"PARAFUSO COM BUCHA S-8","un",8,0.2,0.2,1.6,1.6]
[null,"MATERIAL (C) - TOTAL",null,null,null,null,null,null,694.47,694.47]
[]
[27,"FONTE","CÓDIGO","DESCRIÇÃO","UNIDADE","COEFIC.","CUSTO UNITÁRIO",null,"CUSTO  TOTAL (A) + (B) + (C) + (D) + (E)"]
[null,null,null,null,null,null,"DESONERADO","NÃO DESONER.","DESONERADO","NÃO DESONER."]
[null,"COMPOSIÇÃO","COMP 027_SEE","TELA MOSQUITEIRA EM NYLON COM ESTRUTURA DE ALUMÍNIO, COM FORNECIMENTO DE MÃO DE OBRA E INSTALAÇÃO","M2",null,null,null,123.21,123.21]
[null,"MÃO DE OBRA (B) - TOTAL",null,null,null,null,null,null,0,0]
[null,"COTAÇÃO","COT 002_SEE","TELA MOSQUITEIRA EM NYLON COM ESTRUTURA DE ALUMÍNIO [M²], COM FORNECIMENTO DE MÃO DE OBRA E INSTALAÇÃO","M2",1,123.21333333333332,123.21333333333332,123.21,123.21]
[null,"MATERIAL (C) - TOTAL",null,null,null,null,null,null,123.21,123.21]
[]
[387,"FONTE","CÓDIGO","DESCRIÇÃO","UNIDADE","COEFIC.","CUSTO UNITÁRIO",null,"CUSTO  TOTAL (A) + (B) + (C) + (D) + (E)"]
[null,null,null,null,null,null,"DESONERADO","NÃO DESONER.","DESONERADO","NÃO DESONER."]
[null,"COMPOSIÇÃO","COMP 387_SEE","LÂMPADA LED TUBULAR 18W ","UN ",null,null,null,22.09,22.11]
[null,"AGETOP_I",8,"AJUDANTE","h     ",1.4999999999999999E-2,8.75,10.14,0.13,0.15]
[null,"AGETOP_I",12,"MATERIAL HIDRO-SANITÁRIO",0,1.4999999999999999E-2,0,0,0,0]
[null,"MÃO DE OBRA (B) - TOTAL",null,null,null,null,null,null,0.13,0.15]
[null,"COTAÇÃO","COT 195_SEE","LÂMPADA LED TUBULAR 18W ","UN",1,21.959999999999997,21.959999999999997,21.96,21.96]
[null,"MATERIAL (C) - TOTAL",null,null,null,null,null,null,21.96,21.96]
[]
[36,"FONTE","CÓDIGO","DESCRIÇÃO","UNIDADE","COEFIC.","CUSTO UNITÁRIO",null,"CUSTO  TOTAL (A) + (B) + (C) + (D) + (E)"]
[null,null,null,null,null,null,"DESONERADO","NÃO DESONER.","DESONERADO","NÃO DESONER."]
[null,"COMPOSIÇÃO","COMP 036_SEE","PRESILHA LATÃO 16/35MM 5MM+PARAF FENDA ","UN ",null,null,null,2.3200000000000003,2.4300000000000002]
[null,"AGETOP_I",8,"AJUDANTE","h     ",8.3299999999999999E-2,8.75,10.14,0.73,0.84]
[null,"AGETOP_I",12,"MATERIAL HIDRO-SANITÁRIO",0,8.3299999999999999E-2,0,0,0,0]
[null,"MÃO DE OBRA (B) - TOTAL",null,null,null,null,null,null,0.73,0.84]
[null,"COTAÇÃO","COT 004_SEE","PRESILHA LATÃO 16/35MM 5MM+PARAF FENDA 1/4''X1.1/4''","UN ",1,1.5933333333333335,1.5933333333333335,1.59,1.59]
[null,"MATERIAL (C) - TOTAL",null,null,null,null,null,null,1.59,1.59]
[]
[39,"FONTE","CÓDIGO","DESCRIÇÃO","UNIDADE","COEFIC.","CUSTO UNITÁRIO",null,"CUSTO  TOTAL (A) + (B) + (C) + (D) + (E)"]
[null,null,null,null,null,null,"DESONERADO","NÃO DESONER.","DESONERADO","NÃO DESONER."]
[null,"COMPOSIÇÃO","COMP 039_SEE","MOLDE GRAF CGT 5/8 50MM C","UN ",null,null,null,139.01,139.06]
[null,"AGETOP_I",8,"AJUDANTE","h     ",3.3300000000000003E-2,8.75,10.14,0.28999999999999998,0.34]
[null,"AGETOP_I",12,"MATERIAL HIDRO-SANITÁRIO",0,3.3300000000000003E-2,0,0,0,0]
[null,"MÃO DE OBRA (B) - TOTAL",null,null,null,null,null,null,0.28999999999999998,0.34]
[null,"COTAÇÃO","COT 007_SEE","MOLDE GRAF CGT 5/8 50MM C","UN",1,138.7175,138.7175,138.72,138.72]
[null,"MATERIAL (C) - TOTAL",null,null,null,null,null,null,138.72,138.72]
[]
[550,"FONTE","CÓDIGO","DESCRIÇÃO","UNID ","COEFIC.","CUSTO UNITÁRIO",null,"CUSTO  TOTAL (A) + (B) + (C) + (D) + (E)"]
[null,null,null,null,null,null,"DESONERADO","NÃO DESONER.","DESONERADO","NÃO DESONER."]
[null,"COMPOSIÇÃO","COMP 550_SEE","ALIC P/MOLDE C-84","UN ","-","-","-",87.76,87.81]
[null,"AGETOP_I",8,"AJUDANTE","h     ",3.3300000000000003E-2,8.75,10.14,0.28999999999999998,0.34]
[null,"AGETOP_I",12,"MATERIAL HIDRO-SANITÁRIO",0,3.3300000000000003E-2,0,0,0,0]
[null,"MÃO DE OBRA (B) - TOTAL",null,null,null,null,null,null,0.28999999999999998,0.34]
[null,"COTAÇÃO","COT 292_SEE","ALIC P/MOLDE C-84","UN ",1,87.465000000000003,87.465000000000003,87.47,87.47]
[null,"MATERIAL (C) - TOTAL",null,null,null,null,null,null,87.47,87.47]
[]
[48,"FONTE","CÓDIGO","DESCRIÇÃO","UNIDADE","COEFIC.","CUSTO UNITÁRIO",null,"CUSTO  TOTAL (A) + (B) + (C) + (D) + (E)"]
[null,null,null,null,null,null,"DESONERADO","NÃO DESONER.","DESONERADO","NÃO DESONER."]
[null,"COMPOSIÇÃO","COMP 048_SEE","HASTE ROSQUEADA \"TIRANTE\" 3/8\"","M",null,null,null,8.879999999999999,9.44]
[null,"AGETOP_I",8,"AJUDANTE","h     ",0.4,8.75,10.14,3.5,4.0599999999999996]
[null,"AGETOP_I",12,"MATERIAL HIDRO-SANITÁRIO",0,0.4,0,0,0,0]
[null,"MÃO DE OBRA (B) - TOTAL",null,null,null,null,null,null,3.5,4.0599999999999996]
[null,"COTAÇÃO","COT 012_SEE","HASTE ROSQUEADA \"TIRANTE\" 3/8\"","M",1,5.3833333333333329,5.3833333333333329,5.38,5.38]
[null,"MATERIAL (C) - TOTAL",null,null,null,null,null,null,5.38,5.38]
[]
[24,"FONTE","CÓDIGO","DESCRIÇÃO","UNIDADE","COEFIC.","CUSTO UNITÁRIO",null,"CUSTO  TOTAL (A) + (B) + (C) + (D) + (E)"]
[null,null,null,null,null,null,"DESONERADO","NÃO DESONER.","DESONERADO","NÃO DESONER."]
[null,"COMPOSIÇÃO","COMP 024_SEE","SINALIZADOR FOTOLUMINESCENTE PARA EXTINTOR","UN ",null,"-","-",24.159999999999997,24.279999999999998]
[null,"AGETOP_I",5,"SERVENTE","h     ",0.09,8.75,10.14,0.79,0.91]
[null,"MÃO DE OBRA (B) - TOTAL",null,null,null,null,null,null,0.79,0.91]
[null,"AGETOP_I",3070,"BUCHA DE NYLON S-6","un",2,0.04,0.04,0.08,0.08]
[null,"AGETOP_I",3393,"PARAFUSO P/BUCHA S-6","un",2,0.08,0.08,0.16,0.16]
[null,"SINAPI_I",37556,"PLACA DE SINALIZACAO DE SEGURANCA CONTRA INCENDIO, FOTOLUMINESCENTE, QUADRADA, *20 X 20* CM, EM PVC *2* MM ANTI-CHAMAS (SIMBOLOS, CORES E PICTOGRAMAS CONFORME NBR 13434)","UN    ",1,23.13,23.13,23.13,23.13]
[null,"MATERIAL (C) - TOTAL",null,null,null,null,null,null,23.369999999999997,23.369999999999997]
[]
[25,"FONTE","CÓDIGO","DESCRIÇÃO","UNIDADE","COEFIC.","CUSTO UNITÁRIO",null,"CUSTO  TOTAL (A) + (B) + (C) + (D) + (E)"]
[null,null,null,null,null,null,"DESONERADO","NÃO DESONER.","DESONERADO","NÃO DESONER."]
[null,"COMPOSIÇÃO","COMP 025_SEE","SINALIZADOR FOTOLUMINESCENTE DE EMERGÊNCIA","UN ",null,"-","-",24.159999999999997,24.279999999999998]
[null,"AGETOP_I",5,"SERVENTE","h     ",0.09,8.75,10.14,0.79,0.91]
[null,"MÃO DE OBRA (B) - TOTAL",null,null,null,null,null,null,0.79,0.91]
[null,"AGETOP_I",3070,"BUCHA DE NYLON S-6","un",2,0.04,0.04,0.08,0.08]
[null,"AGETOP_I",3393,"PARAFUSO P/BUCHA S-6","un",2,0.08,0.08,0.16,0.16]
[null,"SINAPI_I",37556,"PLACA DE SINALIZACAO DE SEGURANCA CONTRA INCENDIO, FOTOLUMINESCENTE, QUADRADA, *20 X 20* CM, EM PVC *2* MM ANTI-CHAMAS (SIMBOLOS, CORES E PICTOGRAMAS CONFORME NBR 13434)","UN    ",1,23.13,23.13,23.13,23.13]
[null,"MATERIAL (C) - TOTAL",null,null,null,null,null,null,23.369999999999997,23.369999999999997]
[]
[277,"FONTE","CÓDIGO","DESCRIÇÃO","UNIDADE","COEFIC.","CUSTO UNITÁRIO",null,"CUSTO  TOTAL (A) + (B) + (C) + (D) + (E)"]
[null,null,null,null,null,null,"DESONERADO","NÃO DESONER.","DESONERADO","NÃO DESONER."]
[null,"COMPOSIÇÃO","COMP 277_SEE","MARCAÇÃO NO PISO - 1X1 M PARA EXTINTOR","M2",null,null,null,29.419999999999998,29.49]
[null,"AGETOP_I",5,"SERVENTE","h     ",3.3300000000000003E-2,8.75,10.14,0.28999999999999998,0.34]
[null,"MÃO DE OBRA (B) - TOTAL",null,null,null,null,null,null,0.28999999999999998,0.34]
[null,"SINAPI_I",5318,"SOLVENTE DILUENTE A BASE DE AGUARRAS","L     ",0.13,10.86,10.86,1.41,1.41]
[null,"SINAPI",5824,"CAMINHÃO TOCO, PBT 16.000 KG, CARGA ÚTIL MÁX. 10.685 KG, DIST. ENTRE EIXOS 4,8 M, POTÊNCIA 189 CV, INCLUSIVE CARROCERIA FIXA ABERTA DE MADEIRA P/ TRANSPORTE GERAL DE CARGA SECA, DIMEN. APROX. 2,5 X 7,00 X 0,50 M - CHP DIURNO. AF_06/2014","CHP",3.3E-3,123.81,127,0.41,0.42]
[null,"SINAPI_I",7343,"TINTA A BASE DE RESINA ACRILICA, PARA SINALIZACAO HORIZONTAL VIARIA (NBR 11862)","L     ",0.6,12.55,12.55,7.53,7.53]
[null,"SINAPI_I",7348,"TINTA ACRILICA PREMIUM PARA PISO","L     ",0.03,13.5,13.5,0.41,0.41]
[null,"SINAPI_I",25972,"MICROESFERAS DE VIDRO PARA SINALIZACAO HORIZONTAL VIARIA, TIPO I-B (PREMIX) - NBR 16184","KG    ",2.14,8.8800000000000008,8.8800000000000008,19,19]
[null,"SINAPI",95133,"MÁQUINA DEMARCADORA DE FAIXA DE TRÁFEGO À FRIO, AUTOPROPELIDA, POTÊNCIA 38 HP - CHP DIURNO. AF_07/2016","CHP",3.3E-3,111.85,115.4,0.37,0.38]
[null,"MATERIAL (C) - TOTAL",null,null,null,null,null,null,29.13,29.15]
[]
[412,"FONTE","CÓDIGO","DESCRIÇÃO","UNIDADE","COEFIC.","CUSTO UNITÁRIO",null,"CUSTO  TOTAL (A) + (B) + (C) + (D) + (E)"]
[null,null,null,null,null,null,"DESONERADO","NÃO DESONER.","DESONERADO","NÃO DESONER."]
[null,"COMPOSIÇÃO","COMP 412_SEE","PLACA DE SINALIZAÇÃO EM PVC COD 17 - (316X158) MENSAGEM \"SAÍDA\"","UN ",null,null,null,29.4,29.52]
[null,"AGETOP_I",5,"SERVENTE","h     ",0.09,8.75,10.14,0.79,0.91]
[null,"MÃO DE OBRA (B) - TOTAL",null,null,null,null,null,null,0.79,0.91]
[null,"AGETOP_I",3070,"BUCHA DE NYLON S-6","un",2,0.04,0.04,0.08,0.08]
[null,"AGETOP_I",3393,"PARAFUSO P/BUCHA S-6","un",2,0.08,0.08,0.16,0.16]
[null,"SINAPI_I",37559,"PLACA DE SINALIZACAO DE SEGURANCA CONTRA INCENDIO, FOTOLUMINESCENTE, RETANGULAR, *12 X 40* CM, EM PVC *2* MM ANTI-CHAMAS (SIMBOLOS, CORES E PICTOGRAMAS CONFORME NBR 13434)","UN    ",1,28.37,28.37,28.37,28.37]
[null,"MATERIAL (C) - TOTAL",null,null,null,null,null,null,28.61,28.61]